program: Gaussian 09
title: 000049911
version: EM64L-G09RevD.01
frameworkgroup: C1[X(C15H14Cl3N3)]
method: RPBEPBE
basis: SDD
operation: Freq
keyword: #p
keyword: freq=noraman
keyword: PBEPBE/SDD
title: #p freq=noraman PBEPBE/SDD
converged: YES YES NO NO
title: Mulliken charges:
elementType: Cl Cl Cl N N N C C C C C C C C C C C C C C C H H H H H H H H H H H H H H
charge: -0.053294 -0.073074 -0.064798 -0.137221 -0.469175 -0.084970 0.167710 0.472680 0.494969 -0.638248 -0.617708 -0.432811 -0.322102 -0.266267 -0.290691 -0.183762 -0.207116 -0.126824 -0.235955 -0.253260 -0.232472 0.324592 0.264066 0.240056 0.233773 0.213672 0.275720 0.235049 0.238482 0.269965 0.254706 0.253739 0.256645 0.255899 0.238026
chargesum: 0.00000
title: Mulliken charges with hydrogens summed into heavy atoms:
elementType: Cl Cl Cl N N N C C C C C C C C C C C C C C C
charge: -0.053294 -0.073074 -0.064798 -0.137221 -0.144583 -0.084970 0.167710 0.472680 0.494969 0.099647 0.106732 -0.194329 -0.052137 -0.266267 -0.290691 0.070945 0.046623 -0.126824 0.020690 0.002638 0.005554
polarizability: 2.76259716e+02 2.42027604e+01 2.09872283e+02 -2.00770102e+00 1.16071278e+01 1.87948096e+02
1716.lowfreq: -7.0670 -0.0022 -0.0011 0.0006 0.2004 2.8934 18.9420 30.2737 40.7884
frequency: 18.8421 30.2466 40.6779 56.3124 61.3338 76.4487 88.0703 108.0146 119.6603 151.6220 156.8724 173.1116 197.7565 217.9551 231.9688 254.9546 270.0437 291.2809 307.6642 325.5582 351.7442 369.7525 384.0882 402.4360 410.6020 462.9929 485.3364 493.7156 499.7788 536.7832 554.0064 568.8641 615.2366 638.5856 641.2020 688.9817 698.8903 714.6943 728.1138 757.1458 773.1080 813.5237 825.5580 827.0242 864.0829 888.6253 938.1715 948.8454 956.3225 991.5446 997.0136 1047.4869 1059.3648 1066.7786 1074.6242 1099.5277 1113.2025 1140.0083 1148.3031 1182.9789 1184.2759 1198.2186 1215.3545 1261.3001 1283.5040 1297.2710 1337.8136 1353.1934 1392.5000 1403.5229 1420.1851 1420.9795 1430.6728 1453.3880 1461.8997 1471.2526 1474.8521 1484.1156 1490.9063 1518.0709 1539.6925 1585.6947 1590.2614 1609.1204 1646.2705 2964.6696 2970.5940 3038.0569 3049.9419 3120.4108 3122.2113 3131.0765 3152.5050 3155.7157 3167.6493 3170.4862 3175.8478 3182.1439 3497.6533
redmass: 11.8710 8.4049 3.9109 6.4029 7.1736 3.8349 6.8965 2.1075 3.2899 1.8478 1.5595 3.4446 4.7737 4.6684 5.9403 4.9666 4.9942 7.9063 5.3275 5.2402 4.6950 5.0932 7.6246 4.4705 3.0605 3.8523 5.3243 5.2637 2.7988 5.2193 1.3176 4.6719 6.2837 6.6933 6.5323 6.7784 3.6361 4.7572 9.2367 1.3656 6.5031 1.3675 2.1039 2.7797 4.5475 1.3469 1.3441 1.3203 1.3412 4.1346 2.9598 5.0694 1.4401 2.0262 2.6381 1.2251 1.3408 1.4051 1.4805 1.4477 1.1152 2.5154 3.3044 4.0286 1.9540 1.5878 4.8338 3.9381 2.9819 3.6994 1.4802 2.4377 1.3794 1.2148 1.1578 1.0636 1.8605 1.1288 1.8187 1.8423 6.4358 8.0642 6.3070 6.4288 5.9928 1.0373 1.0383 1.1015 1.0985 1.0982 1.0966 1.0900 1.0865 1.0883 1.0927 1.0954 1.0971 1.1000 1.0762
irintensity: 0.0489 0.1567 0.6745 2.2177 3.0183 0.6788 0.3869 2.1573 4.3138 0.6241 0.7002 1.6791 0.2185 1.3301 7.2735 0.6286 3.4687 0.3404 4.9891 15.4339 0.6324 4.9160 2.0994 8.5787 0.0712 1.0159 19.1335 2.0379 23.5611 2.9396 98.4473 3.1147 2.0830 3.1239 5.6384 30.5499 6.1934 12.2620 83.5018 61.3832 31.1657 9.3396 69.7765 8.3900 3.2936 0.1009 0.1466 1.5504 0.0735 22.7259 64.5240 36.8261 14.9682 6.4444 38.7398 0.2761 9.1507 5.4203 7.2630 9.2218 11.3955 83.8010 30.2278 21.6064 88.9104 52.0945 29.8259 54.4999 163.2817 12.2947 5.7141 39.4784 9.7737 32.9320 49.5862 19.7059 121.4220 3.8198 322.4439 58.0020 16.7159 113.6725 4.5242 109.4814 1281.3376 30.5516 127.7618 40.7588 25.4555 5.0792 9.5897 9.6752 1.2820 3.9464 1.9270 5.4350 0.9199 10.7540 86.0850
temp: 298.150 k
press: 1.00000 atm
elementType: 17 17 17 7 7 7 6 6 6 6 6 6 6 6 6 6 6 6 6 6 6 1 1 1 1 1 1 1 1 1 1 1 1 1 1
symmnumber: 1
zpe: 678047.7 jmol-1
zpe.correction: 0.258255 hartree
zpe.thermalcorrener: 0.279112 hartree
zpe.thermalcorrenthalpy: 0.280056 hartree
zpe.thermalcorrgfe: 0.206142 hartree
zpe.sumelectzpe: -2122.913441 hartree
zpe.sumelectthermal: -2122.892583 hartree
zpe.sumelectthermalent: -2122.891639 hartree
zpe.sumelectthermalfe: -2122.965554 hartree
dipole: -0.2966 0.5401 -1.5853
dipole: 1.7008
quadrupole: -157.8128 -127.4134 -142.6110
quadrupole: 13.3742 -7.3241 -0.0036
quadrupole: -15.2004 15.1990 0.0014 13.3742 -7.3241 -0.0036
hfenergy: -2123.1716956 hartree
pointgroup: C01 [X(C15H14Cl3N3)]
dipole: -0.1035508 -0.497233 0.4356675 debye
polarizability: 280.773248|-15.5010904|191.5447805|-5.8247264|13.4160122|201.7620671 unknown
InChI: InChI=1S/C15H14Cl3N3/c1-21(2)15(19-11-8-6-10(16)7-9-11)20-14-12(17)4-3-5-13(14)18/h3-9,19H,1-2H3
charge 0 multiplicity 1
35 atoms
Cl -2.040511 0.22276 -2.982776
Cl -2.37998 -0.451186 2.568555
Cl 5.958649 2.054144 0.11945
N  0.464921 -2.439528 -0.416891
N  0.463298 -0.409448 0.848092
N  -1.490363 -1.169474 -0.351328
C  -0.233595 -1.321806 0.018968
C  1.758123 0.134579 0.645912
C  -2.291123 -0.041727 -0.21105
C  1.579781 -3.032537 0.339807
C  -0.117295 -3.275137 -1.480667
C  2.338517 0.904365 1.691921
C  2.478327 -0.03256 -0.568311
C  -2.730963 0.689459 -1.361704
C  -2.866702 0.409373 1.017115
C  3.608632 1.495323 1.533568
C  3.753914 0.54901 -0.725807
C  4.306499 1.304275 0.325629
C  -3.651009 1.748213 -1.307462
C  -3.796769 1.457826 1.115434
C  -4.193198 2.134044 -0.059423
H  -0.107422 0.016519 1.584126
H  1.741394 -2.484385 1.279271
H  2.520203 -3.010212 -0.243258
H  1.343085 -4.086138 0.585039
H  0.699063 -3.724651 -2.075041
H  -0.756004 -2.651564 -2.123769
H  -0.745882 -4.086149 -1.062116
H  1.79529 1.042223 2.634245
H  2.037973 -0.599635 -1.393089
H  4.047302 2.08872 2.340879
H  4.302616 0.423532 -1.663922
H  -3.938584 2.264183 -2.227847
H  -4.201728 1.738558 2.091614
H  -4.916959 2.952331 -0.004064
