program: Gaussian 16
title: Title Card Required
version: ES64L-G16RevC.01
frameworkgroup: C1[X(C6H7O)]
method: UB3LYP
basis: Aug-CC-pVTZ
operation: Freq
keyword: #P
keyword: Geom=AllCheck
keyword: Guess=TCheck
keyword: SCRF=Check
keyword: GenChk
keyword: UB3LYP/Aug-CC-pVTZFreq
converged: YES YES YES YES
polarizability: 8.60239322e+01 8.73740073e-01 7.67478946e+01 2.52678260e+00 5.51705185e-02 4.29482227e+01
1716.lowfreq: -0.0009 -0.0005 -0.0005 3.6701 4.0562 11.2326 174.8321 239.3222 330.9113
frequency: 174.8321 239.3222 330.9113 394.4552 402.5116 518.1950 591.5321 603.3462 728.3677 756.2664 809.1654 932.7349 977.7290 1013.9699 1035.5004 1038.7517 1069.8242 1085.0952 1129.4753 1173.3395 1199.7534 1216.5359 1249.9874 1365.8989 1402.3913 1483.9473 1491.2602 1564.9619 1631.4545 2586.6365 3182.5507 3186.4092 3195.8404 3206.2852 3210.7248 3785.6530
redmass: 4.1266 1.1625 2.9337 3.0760 2.7604 5.3137 5.6136 1.9629 1.7660 1.8376 1.4941 1.2177 3.3960 2.5308 1.5022 1.5023 1.4631 1.5923 1.1959 1.8003 1.2042 1.1484 2.3573 1.3881 2.5289 2.1230 2.6891 3.0928 5.0538 1.0663 1.0908 1.0917 1.0916 1.0957 1.0979 1.0673
irintensity: 11.8753 85.7636 3.6033 6.2575 19.7200 6.9292 5.2643 36.5077 34.3790 16.6363 45.7594 27.8208 2.3058 0.1885 5.3305 2.1595 4.9849 39.1618 43.0689 75.7557 7.5270 34.3233 26.7221 20.5095 42.4177 65.3490 86.4224 0.4764 38.4708 94.8329 1.8230 2.4370 7.9674 8.8940 5.0825 130.9717
temp: 298.150 k
press: 1.00000 atm
elementType: 6 6 6 6 6 1 1 1 1 1 6 1 8 1
symmnumber: 1
zpe: 298860.8 jmol-1
zpe.correction: 0.113830 hartree
zpe.thermalcorrener: 0.119934 hartree
zpe.thermalcorrenthalpy: 0.120879 hartree
zpe.thermalcorrgfe: 0.084251 hartree
zpe.sumelectzpe: -307.753725 hartree
zpe.sumelectthermal: -307.747621 hartree
zpe.sumelectthermalent: -307.746676 hartree
zpe.sumelectthermalfe: -307.783304 hartree
hfenergy: -307.867555 hartree
pointgroup: C01 [X(C6H7O1)]
dipole: -0.5611899 0.4337992 0.5550578 debye
dipolederiv: -0.3728645 -0.6446347 -0.017968 -0.2793645 -0.1983113 -0.0289549 0.0081228 0.0014248 -0.0514029 0.2849757 0.3916507 0.0944733 -0.0036199 -0.0175189 -0.0858001 0.2378286 0.0613272 0.0696089 0.3778857 -0.4052007 0.1041953 0.0592222 -0.0101607 0.0995063 0.2275723 -0.0468836 0.1032136 -0.4114972 0.6658012 -0.0313332 0.2947036 -0.202719 0.0326774 -0.0026904 0.003162 -0.0549995 0.3974587 0.0016874 0.0120012 -0.0104447 0.6650699 -0.0059592 0.0205571 -0.001063 0.1006784 0.0866752 0.002694 -0.0038202 0.002847 0.0770955 0.001303 -0.0273335 -0.0211185 0.1433021 0.0761005 -0.0021672 -0.0129029 -0.0125024 0.1080594 0.0042177 -0.0098418 0.0018208 0.1194175 0.1124573 -0.0197615 -0.0124019 -0.0069612 0.1313666 -0.003756 -0.0097322 -0.003004 0.1196603 0.0900544 -0.0011227 -0.0045084 -0.001075 0.0822527 -0.0006153 -0.0224734 0.0182391 0.1431367 0.0937602 -0.000294 0.0005528 -0.0004796 0.1086522 0.0000013 0.0128002 -0.0001546 0.1110536 0.8932271 -0.0003971 -0.2629769 -0.0337906 0.0814636 -0.040852 -0.9960739 -0.0453569 0.1122806 -0.0602809 -0.0044044 0.0009473 -0.015778 0.1990121 -0.0072349 0.2444528 0.0023036 0.1205314 -1.0097152 -0.0149496 0.1152183 -0.0428923 -0.2499637 0.1048228 0.3055428 0.0861098 -0.3339063 0.4417628 0.0310987 0.0185233 0.0501355 0.2257015 -0.0693562 0.0112685 -0.0568067 0.2974255 unknown
polarizability: 86.0299878|0.8969594|76.752401|2.4348526|0.0693157|42.9376607 unknown
InChI: InChI=1S/C6H7O/c7-6-4-2-1-3-5-6/h1-7H
charge 1 multiplicity 1
14 atoms
C  -1.17421681 1.23434583 -0.02992182
C  0.19124912 1.25969934 0.02273786
C  0.19829427 -1.24259962 0.03459183
C  -1.16961066 -1.22792819 -0.02299595
C  -1.84562169 -0.00051601 -0.0629631
H  -1.73810173 2.15445304 -0.08606803
H  0.74041396 2.19327211 0.02340993
H  0.77172782 -2.16067926 0.03891931
H  -1.72524414 -2.15306008 -0.07476139
H  -2.92622933 -0.00238684 -0.13303312
C  0.94680328 0.00782415 0.19057996
H  0.89185374 -0.00979089 1.3354469
O  2.25264276 -0.08497051 -0.25170017
H  2.80110241 0.64250794 0.0664518
