program: Gaussian 16
title: Title Card Required
version: ES64L-G16RevC.01
frameworkgroup: C1[X(C6H6O)]
method: UB3LYP
basis: Aug-CC-pVTZ
operation: Freq
keyword: #P
keyword: Geom=AllCheck
keyword: Guess=TCheck
keyword: SCRF=Check
keyword: GenChk
keyword: UB3LYP/Aug-CC-pVTZ
keyword: Freq
converged: YES YES YES YES
polarizability: 9.38347063e+01 -1.21024490e+00 8.45969762e+01 -3.45893076e-05 -9.32074105e-06 4.68546305e+01
1716.lowfreq: -9.8454 -7.6710 -6.0574 -0.0007 -0.0007 0.0009 229.3084 350.4652 406.4096
frequency: 229.3084 350.4652 406.4096 422.9573 517.1460 536.6920 633.6699 704.7680 772.8995 830.2809 833.7676 906.0208 980.7563 1001.0554 1018.3991 1045.3197 1094.5891 1175.7361 1191.2894 1191.9665 1279.5273 1348.0320 1374.6752 1504.7388 1531.7466 1635.6561 1646.1372 3149.4137 3168.4213 3176.9393 3190.1409 3196.7513 3814.1267
redmass: 4.3252 1.1081 3.9405 2.9268 2.7070 7.2730 6.4366 1.9627 1.6977 5.7676 1.2540 1.4889 1.3570 1.3049 6.1433 2.0751 1.5585 1.1770 1.1342 1.2769 3.6210 4.2760 1.3108 2.2505 2.3169 5.7391 5.6389 1.0882 1.0864 1.0909 1.0928 1.0968 1.0660
irintensity: 0.8913 96.7731 9.3211 0.3814 12.9964 2.1468 0.3221 29.7014 53.4350 20.8178 0.0032 6.4623 0.0243 0.1949 3.1542 4.2684 13.0799 24.3023 3.0187 126.9698 89.5659 6.8695 23.1456 22.3996 52.8173 48.2724 37.0063 13.1104 0.1452 15.0353 14.9749 5.2383 60.6638
temp: 298.150 k
press: 1.00000 atm
elementType: 6 6 6 6 6 6 1 1 1 1 1 8 1
symmnumber: 1
zpe: 274302.5 jmol-1
zpe.correction: 0.104476 hartree
zpe.thermalcorrener: 0.109983 hartree
zpe.thermalcorrenthalpy: 0.110927 hartree
zpe.thermalcorrgfe: 0.075499 hartree
zpe.sumelectzpe: -307.485835 hartree
zpe.sumelectthermal: -307.480328 hartree
zpe.sumelectthermalent: -307.479384 hartree
zpe.sumelectthermalfe: -307.514812 hartree
hfenergy: -307.5903112 hartree
pointgroup: C01 [X(C6H6O1)]
dipole: -0.0028026 0.4987865 0.0000045 debye
dipolederiv: -0.0275821 0.0112507 0. -0.0090313 -0.2281526 0. -0.0000002 0.0000001 -0.1610242 0.1487546 -0.0973795 -0.0000002 0.0203158 0.1358803 -0.0000001 -0.0000001 0. -0.1274552 -0.2843585 0.0413274 0.0000002 -0.3021109 -0.0024181 -0.0000002 -0.0000002 -0.0000003 -0.1633079 1.5232641 -0.0021229 -0.0000005 -0.0014392 0.087306 -0.0000005 0.000001 -0.0000004 0.0695123 -0.2807153 -0.0299793 0. 0.274706 0.0087721 0. 0.0000005 0. -0.1517588 0.165863 0.0696561 -0.0000002 -0.0048501 0.1492883 0. -0.0000002 -0.0000002 -0.1245343 -0.099907 -0.0028971 0. -0.002318 0.0583553 0. 0.0000001 0. 0.1429081 0.0267347 -0.0668756 0. -0.0709562 -0.0610507 0.0000002 0.0000001 0. 0.1287215 -0.0254159 0.0890103 0.0000001 0.0883068 -0.0407013 0.0000001 0. 0.0000003 0.1453821 0.0339492 -0.0593356 0. -0.060553 -0.0219183 0.0000001 0.0000002 0.0000002 0.1455816 0.0231317 0.0725103 0. 0.0734202 -0.0548512 0. 0. 0. 0.1276326 -1.5698339 0.0183756 0.0000008 0.0110637 -0.1681211 0.0000018 -0.0000024 0.0000015 -0.3415838 0.3661154 -0.0435404 -0.0000006 -0.0165537 0.1376112 -0.0000012 0.0000011 -0.0000011 0.3099261 unknown
polarizability: 93.8319134|-1.2208542|84.5997691|-0.0000346|-0.0000093|46.8546305 unknown
InChI: InChI=1S/C6H6O/c7-6-4-2-1-3-5-6/h1-5,7H
charge 0 multiplicity 1
13 atoms
C  1.85282171 0.02735193 -0.00000013
C  1.13098334 1.21458938 -0.00000069
C  -0.25917109 1.19513907 0.00000008
C  -0.93398233 -0.02307323 0.00000146
C  -0.21815571 -1.21767448 0.00000134
C  1.16907655 -1.18522209 0.00000048
H  2.933445 0.0455084 -0.0000005
H  1.64784631 2.1648105 -0.00000144
H  -0.81851938 2.12344669 -0.00000066
H  -0.75914154 -2.15350532 0.00000218
H  1.71994682 -2.11620137 0.00000054
O  -2.2993863 -0.10685115 0.00000073
H  -2.68016739 0.77679768 0.00000861
