program: Gaussian 16
title: Title Card Required
version: ES64L-G16RevC.01
frameworkgroup: C1[X(C6H9O2)]
method: UB3LYP
basis: Aug-CC-pVTZ
operation: Freq
keyword: #P
keyword: Geom=AllCheck
keyword: Guess=TCheck
keyword: SCRF=Check
keyword: GenChk
keyword: UB3LYP/Aug-CC-pVTZFreq
converged: YES YES NO YES
polarizability: 1.05944008e+02 -1.18614870e+00 9.05299030e+01 2.48029697e-03 2.66974401e-04 4.99273293e+01
1716.lowfreq: -6.5614 -0.0003 0.0001 0.0009 1.4676 3.4403 54.1907 73.7671 168.7919
frequency: 54.1781 73.7671 168.7918 199.3582 212.8027 212.9747 332.7511 358.7774 401.9511 444.3320 518.5795 519.9459 605.8903 685.7462 804.4775 812.2575 906.1721 925.8247 946.1214 993.6524 1018.1544 1042.7086 1050.9077 1130.7854 1142.0967 1202.3390 1268.0398 1282.7975 1329.0304 1360.8086 1416.2114 1472.4247 1496.4708 1595.3536 1636.1674 1648.6199 2937.1620 2945.4942 3171.8596 3195.9531 3197.2036 3208.7818 3309.1569 3773.0855 3859.8829
redmass: 3.9410 4.7623 1.2663 2.1565 5.1078 1.3199 1.1110 1.2511 2.5570 4.0657 7.5043 2.8566 6.0627 1.6763 1.2740 5.4495 1.2610 1.3871 2.3619 4.3968 1.3400 1.5380 1.4149 1.2073 1.3210 1.1491 1.1375 1.4304 2.4767 1.6331 2.7101 1.8214 3.0934 3.6146 2.7279 1.2806 1.0847 1.0666 1.0914 1.0895 1.0923 1.0979 1.0714 1.0444 1.0830
irintensity: 6.9113 3.8606 8.6806 19.4848 20.8050 11.8611 12.7125 179.7164 0.9104 30.4397 0.6134 0.6925 1.5661 33.0573 0.5335 18.1096 109.7088 4.8221 21.4281 0.7165 0.0405 15.4007 0.1606 0.0497 1.1158 11.0879 166.4374 164.3659 19.6179 113.7292 47.7620 111.2084 61.9100 147.2282 32.6227 90.2221 20.8295 54.1077 1.2303 3.9974 9.7673 2.8389 1542.6754 44.3160 131.9224
temp: 298.150 k
press: 1.00000 atm
elementType: 6 6 6 6 1 1 1 8 1 8 1 1 6 1 1 6 1
symmnumber: 1
zpe: 364082.5 jmol-1
zpe.correction: 0.138672 hartree
zpe.thermalcorrener: 0.147937 hartree
zpe.thermalcorrenthalpy: 0.148882 hartree
zpe.thermalcorrgfe: 0.104357 hartree
zpe.sumelectzpe: -384.241067 hartree
zpe.sumelectthermal: -384.231801 hartree
zpe.sumelectthermalent: -384.230857 hartree
zpe.sumelectthermalfe: -384.275382 hartree
hfenergy: -384.3797384 hartree
pointgroup: C01 [X(C6H9O2)]
dipole: 0.3917661 0.5563741 0.000165 debye
dipolederiv: -0.6477428 -0.3342199 -0.0000346 0.1333867 0.2324812 0.0000076 -0.0000189 -0.0000037 -0.0532999 0.3455731 0.1364199 0.0000097 -0.1752573 0.4163259 0.0000005 0.0000113 0.000011 0.0600739 1.606066 1.0274418 0.000078 0.6901376 -0.4948968 0.0000246 0.0000789 0.0000318 0.1568617 0.3630427 0.0997862 0.0000223 -0.4326876 -0.0894447 -0.0000491 0.0000358 -0.0000066 0.0088542 0.0814079 -0.003284 -0.0000026 -0.0032509 0.050303 -0.0000011 -0.0000067 -0.0000013 0.14324 0.1158634 -0.0001556 -0.000005 0.0214773 0.1130811 0.0000015 -0.00001 0.0000027 0.1015305 0.0855891 0.0029346 -0.0000027 -0.0045123 0.0913534 0.0000017 -0.0000008 0.0000004 0.1172312 -1.8300292 -0.3857944 -0.0000506 -0.2803819 -0.3212813 -0.0000292 -0.0000711 -0.0000092 -0.3059278 1.1086667 -0.1802889 0.0000166 -0.4826779 0.2898721 0.0000043 0.0000392 0.000003 0.2641018 -0.7820912 0.0901258 -0.0000344 0.2214578 -0.5722745 -0.0000579 -0.0000988 -0.0000493 -0.4650885 0.2490029 0.0051082 0.003923 0.0013249 0.321008 -0.0117149 0.0298989 -0.0129077 0.308189 0.2490685 0.005117 -0.0039051 0.0012639 0.320959 0.0117708 -0.0298178 0.012938 0.3081648 -0.3613508 0.2901293 -0.0000452 0.2739935 -0.1939564 0.0000342 -0.0001268 0.000098 -0.0360018 0.234665 -0.0378435 0.005806 -0.0670373 0.2040269 -0.0006051 0.0274164 -0.0158909 0.1461616 0.2346868 -0.0378319 -0.005784 -0.067035 0.2040522 0.000591 -0.0273413 0.0158441 0.1461583 -0.1391383 -0.6649925 0.0000125 0.1800211 0.3165564 0.000021 0.0000149 -0.0000576 -0.0216359 0.0867202 -0.0126522 -0.0000039 -0.0102226 0.1118345 0.0000002 -0.0000034 -0.0000027 0.1213867 unknown
polarizability: 105.9249162|1.3041703|90.5489943|0.0024823|-0.000248|49.9273293 unknown
InChI: InChI=1/6C.2O.9H
charge 1 multiplicity 1
17 atoms
C  1.14587163 1.54518467 -0.00000484
C  -0.08119519 0.86511237 -0.00005606
C  -0.18874554 -0.54653457 -0.00009787
C  2.3147671 0.8393744 0.00002812
H  1.1483145 2.62574309 0.00000819
H  -0.99895517 1.44224735 -0.00007399
H  3.27431458 1.33779818 0.00006888
O  -1.35283948 -1.18634272 -0.00016341
H  -2.13721901 -0.5847216 -0.00025449
O  -3.46923227 0.47643185 -0.00006304
H  -4.05142986 0.47710547 -0.76891772
H  -4.0511518 0.47578849 0.76900474
C  2.28420723 -0.62053735 0.00003584
H  2.88854043 -0.99841828 -0.84563078
H  2.88828937 -0.99831481 0.84594298
C  0.98122435 -1.27821339 -0.00005763
H  0.93541812 -2.35916414 -0.00007591
