program: Gaussian 16
title: Title Card Required
version: ES64L-G16RevC.01
frameworkgroup: C1[X(C6H9O2)]
method: UB3LYP
basis: Aug-CC-pVTZ
operation: Freq
keyword: #P
keyword: Geom=AllCheck
keyword: Guess=TCheck
keyword: SCRF=Check
keyword: GenChk
keyword: UB3LYP/Aug-CC-pVTZFreq
converged: YES YES YES YES
polarizability: 1.02318910e+02 -1.50933030e+00 8.49745151e+01 1.03553899e+00 -1.06700736e+00 5.08582887e+01
1716.lowfreq: -573.6979 -5.4179 -2.1233 -1.4868 -0.0010 -0.0005 0.0010 49.0977 71.8803
frequency: -573.6979 49.0976 71.8797 169.0854 212.3842 236.3479 328.3081 355.4071 378.1611 441.6646 487.9922 537.9443 611.5113 640.6540 781.4632 807.1087 872.9509 896.5834 984.6052 1015.5757 1028.2955 1032.0298 1058.9287 1087.4142 1116.3205 1200.5421 1204.2943 1247.5369 1304.1813 1368.8843 1442.5927 1488.1489 1516.2373 1577.7606 1633.5824 1647.4749 2228.2889 3189.6261 3194.9882 3199.6578 3205.6142 3211.9409 3293.3469 3773.0713 3859.4905
redmass: 1.3857 4.3787 4.7143 1.0528 4.7096 4.0665 1.1010 1.3390 2.4242 3.7279 3.0084 4.4403 6.0285 1.8622 2.9937 1.5153 1.3092 1.0523 2.5502 2.1343 1.4306 1.9434 1.4217 1.5839 1.2192 1.1585 1.1149 1.6362 4.2115 1.7149 1.7936 2.1904 1.8923 3.7655 4.3454 1.1116 1.0675 1.0896 1.0904 1.0926 1.0961 1.0979 1.0721 1.0445 1.0830
irintensity: 161.8978 4.1139 2.7198 20.2659 19.5008 6.3158 14.1441 173.3845 24.4445 12.7369 12.4058 1.5806 1.5049 23.4292 19.8815 67.7757 2.9745 77.0189 2.6816 2.2205 0.6986 0.4474 2.0324 12.2748 9.0472 4.9523 2.8322 64.2095 126.5236 11.8803 108.1463 104.9199 25.7526 1.0632 5.6481 61.8693 80.2638 0.3487 3.5523 4.8440 7.7484 4.5626 1527.6753 45.2869 132.3197
temp: 298.150 k
press: 1.00000 atm
elementType: 6 6 6 6 6 6 1 1 1 1 1 8 1 1 8 1 1
symmnumber: 1
zpe: 358813.7 jmol-1
zpe.correction: 0.136665 hartree
zpe.thermalcorrener: 0.145434 hartree
zpe.thermalcorrenthalpy: 0.146378 hartree
zpe.thermalcorrgfe: 0.102724 hartree
zpe.sumelectzpe: -384.219518 hartree
zpe.sumelectthermal: -384.210749 hartree
zpe.sumelectthermalent: -384.209804 hartree
zpe.sumelectthermalfe: -384.253459 hartree
hfenergy: -384.3561826 hartree
pointgroup: C01 [X(C6H9O2)]
dipole: 0.0616952 0.4901633 0.3703408 debye
dipolederiv: 0.0043495 0.3775303 0.0042516 0.195255 -0.4363769 0.0031022 -0.0098213 -0.0469908 -0.0612154 0.1312069 -0.4326463 0.1308626 -0.0283994 0.1701657 0.0531058 0.2777326 -0.1603411 0.0830024 1.2305963 -0.3974625 -0.2642686 -0.5373097 0.3135718 0.1025243 -0.8999249 0.3784596 0.1587366 0.1315476 0.1449003 0.0380465 0.0288598 -0.1672137 -0.1001173 0.1919403 -0.0383056 0.0054439 -0.3384831 -0.2486312 -0.0226255 -0.0169588 0.1907449 -0.0070163 0.0239131 0.0150187 -0.0434647 0.2546738 0.0485432 0.0047692 -0.0441433 0.3209489 0.0084743 0.0137316 -0.0245324 0.0321978 0.0776418 -0.009125 -0.0031098 -0.0052745 0.0833356 0.0029018 -0.007991 0.0461505 0.1396898 0.1010816 0.000999 -0.0188829 0.0124906 0.1264068 0.0024379 -0.01329 -0.008744 0.1289264 0.1209578 0.0070061 -0.0045238 -0.012353 0.0984279 0.0074304 -0.0016021 0.0139712 0.1216116 0.0853615 -0.0034725 -0.0020997 -0.0009542 0.0547884 0.0010326 -0.0316513 -0.0072477 0.1347036 0.0721699 0.0107948 -0.000099 0.0094823 0.095543 0.0014083 0.0108665 -0.0039808 0.1221095 -1.5594746 0.2323656 0.1306932 0.1706364 -0.4434774 -0.0289526 0.2439813 -0.0965737 -0.3281887 1.1136792 0.1778268 0.0116263 0.4632665 0.3024863 -0.0156831 0.0382716 0.0029141 0.257703 -0.1454824 0.1918654 0.0004501 -0.0159468 0.2222215 -0.0243691 0.1858827 -0.0612412 0.0964798 -0.7796577 -0.0889536 -0.0065484 -0.2103659 -0.5749817 -0.0116593 -0.0268982 -0.0150617 -0.4636421 0.2475487 -0.0073792 0.0063322 -0.0074116 0.3199357 0.0140905 0.0321591 0.0160182 0.3098748 0.2522832 -0.0041613 -0.0048739 -0.0008735 0.3234731 -0.0087103 -0.0273 -0.0095136 0.3060317 unknown
polarizability: 102.288347|-1.6866736|85.0092054|0.9771459|-1.0380013|50.8541612 unknown
InChI: InChI=1/6C.2O.9H
charge 1 multiplicity 1
17 atoms
C  -2.29923292 -0.6372699 -0.0130873
C  -1.06655367 -1.27640997 0.00914781
C  0.15973501 -0.50135259 0.06830114
C  0.04648253 0.94367576 0.01269753
C  -1.19076075 1.53166644 -0.01629079
C  -2.35768781 0.74706996 -0.05015912
H  -3.20348569 -1.228304 -0.01730969
H  -0.96528832 -2.35297231 0.04850535
H  0.9568003 1.52822773 0.0211738
H  -1.27081165 2.60936368 -0.03505963
H  -3.32102671 1.23730781 -0.08797672
O  1.30770856 -1.15884716 -0.17445865
H  2.1077998 -0.58365761 -0.08293593
H  -0.19135514 -0.61635228 1.21626351
O  3.45111373 0.44519513 0.02126886
H  4.06162787 0.36319518 0.76320887
H  4.00396588 0.53339912 -0.76412404
