program: Gaussian 16
title: Title Card Required
version: ES64L-G16RevC.01
frameworkgroup: C1[X(C6H9O2)]
method: UB3LYP
basis: Aug-CC-pVTZ
operation: Freq
keyword: #P
keyword: Geom=AllCheck
keyword: Guess=TCheck
keyword: SCRF=Check
keyword: GenChk
keyword: UB3LYP/Aug-CC-pVTZFreq
converged: YES YES NO YES
polarizability: 1.07144648e+02 2.38311165e+00 8.57189582e+01 -7.57732968e-04 -2.80134998e-04 4.98169697e+01
1716.lowfreq: -5.9510 -2.6161 -1.6724 -0.0006 -0.0003 -0.0002 69.3355 81.2659 126.8083
frequency: 69.3352 81.2658 126.8082 151.8822 237.8672 269.1435 356.8353 391.2797 447.2894 471.7530 512.6191 521.6369 603.3501 745.1756 799.1744 843.8456 934.2260 950.3161 985.2813 1025.1825 1030.7045 1058.2719 1110.2182 1188.0261 1197.7136 1201.0801 1264.8240 1343.4665 1354.5982 1399.8953 1461.9670 1470.0959 1544.3372 1571.2333 1644.6243 1669.5847 2982.9334 3000.7004 3008.4657 3179.8530 3193.0820 3202.5643 3212.7711 3770.7526 3857.6361
redmass: 3.9868 4.7865 1.7957 1.1833 4.6825 2.2391 1.2427 1.1407 2.4512 4.4062 7.3017 1.9713 6.3186 1.3444 4.8827 1.4999 1.9297 4.9927 2.2183 1.3239 1.9982 1.4229 1.0693 1.1547 1.1923 1.1018 1.5410 1.1849 1.6881 1.4643 1.8872 3.2966 3.3036 3.8478 1.0906 5.1606 1.0733 1.0660 1.0920 1.0903 1.0899 1.0942 1.0977 1.0442 1.0835
irintensity: 2.9791 2.3599 0.0424 33.7210 37.4029 0.5437 205.6492 12.2799 0.0328 17.8674 3.3469 13.9507 3.7662 41.1281 12.0018 6.6974 2.6971 9.3922 6.2692 4.9232 0.7714 1.6959 92.7863 0.1283 27.5098 27.4876 7.2463 52.6069 20.0283 158.8008 276.8200 231.2367 285.3904 32.5681 51.8295 116.8050 2069.0542 382.9717 11.5447 0.7305 1.2111 4.3214 0.8869 58.5569 146.6779
temp: 298.150 k
press: 1.00000 atm
elementType: 6 6 6 6 6 1 1 1 1 8 1 8 1 1 6 1 1
symmnumber: 1
zpe: 367514.7 jmol-1
zpe.correction: 0.139979 hartree
zpe.thermalcorrener: 0.149037 hartree
zpe.thermalcorrenthalpy: 0.149981 hartree
zpe.thermalcorrgfe: 0.105907 hartree
zpe.sumelectzpe: -384.265174 hartree
zpe.sumelectthermal: -384.256116 hartree
zpe.sumelectthermalent: -384.255172 hartree
zpe.sumelectthermalfe: -384.299246 hartree
hfenergy: -384.4051531 hartree
pointgroup: C01 [X(C6H9O2)]
dipole: -0.6039192 0.2277249 0.000078 debye
dipolederiv: 1.0521171 -0.0102009 -0.0000312 -0.0928018 0.4094705 -0.0000725 -0.0000328 -0.0000635 0.0650083 -0.6108195 -0.2073424 0.0000653 -1.1049857 -0.5619539 0.0001354 0.0002629 0.0001087 -0.1131627 1.4896518 0.3695732 -0.0000052 1.322435 0.9926982 -0.0002245 -0.0002193 -0.0001912 0.236431 -0.0643933 0.157206 -0.0000855 -0.3968302 0.3777167 -0.0001226 0.0001409 -0.000168 -0.0360316 -0.2026852 0.1915826 -0.0000541 0.7462883 -0.4236553 0.0000607 -0.0001656 0.000065 -0.0830106 0.1064487 0.0084306 -0.0000022 0.0097784 0.0498785 0.0000116 -0.0000006 0.0000111 0.1057572 0.0632082 0.0096238 0.0000014 0.0106799 0.0801942 0.0000172 -0.0000103 0.0000143 0.1486905 0.0595143 0.0116032 0.0000035 -0.0004189 0.0769951 0.0000132 0.0000155 0.0000131 0.1159933 0.0394592 -0.0140406 0.0000125 -0.0079859 0.0721913 0.0000211 0.0000071 0.0000213 0.1518935 -2.0641598 -0.3562024 0.0000551 -0.3586419 -0.5251991 0.0000661 0.0000784 0.0000652 -0.2676746 1.4393458 -0.18017 0.0000612 -0.6113129 0.3075269 -0.0000246 0.0001889 -0.0000219 0.2600311 -0.8902192 0.0951237 -0.0000511 0.2632524 -0.5566955 0.0000033 -0.0001768 0.0000142 -0.4620154 0.2577819 0.004743 0.0120945 0.0052437 0.3271546 -0.012567 0.0484308 -0.0148218 0.3198375 0.2578172 0.0047486 -0.012087 0.005195 0.3271401 0.0125867 -0.0483727 0.0148268 0.3198051 -0.1327378 -0.0395687 0.0000125 0.258689 -0.3590326 0.0001784 -0.0001987 0.0002895 0.0099883 0.0998216 -0.0225498 -0.0028787 -0.0243097 0.2027636 -0.0093494 -0.017725 -0.0233116 0.114245 0.0998491 -0.0225598 0.0028889 -0.0242748 0.2028066 0.0092669 0.0177773 0.0231489 0.1142141 unknown
polarizability: 107.1048315|2.5555279|85.7587719|-0.0021929|-0.009553|49.8169723 unknown
InChI: InChI=1/6C.2O.9H
charge 1 multiplicity 1
17 atoms
C  1.18135269 1.51317237 -0.00027637
C  -0.07367118 0.95270768 -0.00007708
C  -0.19332399 -0.44397701 0.00021861
C  2.32075165 -0.59627779 0.00012939
C  2.38825255 0.74939672 -0.00019649
H  1.26059731 2.59324442 -0.00052321
H  -0.96069843 1.56988129 -0.00018116
H  3.21469055 -1.20498682 0.00020443
H  3.33773449 1.2637149 -0.00040237
O  -1.32061692 -1.07558814 0.00033315
H  -2.14028528 -0.48926105 0.00021001
O  -3.4707607 0.4069114 -0.00000742
H  -4.04940839 0.3949546 -0.77168933
H  -4.04928023 0.39469389 0.7717683
C  1.01872528 -1.30099668 0.00046165
H  0.95960438 -1.98520648 -0.85765287
H  0.95973122 -1.98431929 0.85931373
