program: Gaussian 09
title: 000049849
version: EM64L-G09RevD.01
frameworkgroup: C1[X(C11H17BrN4O)]
method: RPBEPBE
basis: SDD
operation: Freq
keyword: #p
keyword: freq=noraman
keyword: PBEPBE/SDD
title: #p freq=noraman PBEPBE/SDD
converged: YES YES NO NO
title: Mulliken charges:
elementType: Br O N N N N C C C C C C C C C C C H H H H H H H H H H H H H H H H H
charge: -0.034817 -0.472973 -0.402361 -0.181498 -0.633613 -0.656657 -0.123261 -0.388427 -0.470861 0.571070 -0.432060 -0.350656 0.454501 -0.342562 -0.426218 -0.812511 0.243914 0.233120 0.229694 0.199373 0.195618 0.231549 0.337752 0.234277 0.241456 0.222679 0.368088 0.223467 0.219909 0.230756 0.327679 0.303002 0.317208 0.343364
chargesum: 0.00000
title: Mulliken charges with hydrogens summed into heavy atoms:
elementType: Br O N N N N C C C C C C C C C C C
charge: -0.034817 -0.104885 -0.064610 -0.181498 -0.002932 0.003915 0.109859 0.040640 -0.043694 0.571070 -0.432060 -0.116379 0.454501 -0.101105 -0.203538 -0.138380 0.243914
polarizability: 2.32304281e+02 -4.42588318e+00 1.83307914e+02 -6.05888067e+00 -2.82175786e+00 1.15451860e+02
1716.lowfreq: -22.3483 -11.7758 -5.5433 -4.8862 0.0003 0.0004 0.0005 15.6252 20.6749
frequency: -22.0417 14.6623 20.5391 35.4012 60.3733 70.8186 115.1290 133.1883 148.0127 160.6133 176.7042 195.9008 224.6306 233.5612 279.7561 310.5951 331.5732 351.7372 367.1464 414.0895 428.9803 431.3969 435.9264 452.8530 499.6326 539.0375 542.9131 554.3044 562.8850 607.9369 637.9777 661.3471 674.3924 707.5412 720.1519 776.1914 801.0908 832.2343 856.1015 870.3913 884.5441 926.7632 933.9198 978.0239 989.7965 1012.3879 1018.0967 1033.9639 1043.6264 1058.2607 1088.2911 1119.7389 1156.6393 1176.2987 1194.7929 1211.4913 1231.0416 1238.5552 1265.2072 1294.3137 1331.5393 1338.5567 1358.8071 1362.9165 1395.0844 1400.8492 1413.3622 1431.8195 1440.4975 1453.4027 1470.6324 1475.1733 1477.0790 1527.2507 1552.5244 1606.6094 1622.0668 1631.8936 1680.3623 2907.1145 2916.1055 2967.3074 2967.5844 2981.5126 3044.0365 3045.1545 3076.3983 3120.2923 3141.8097 3156.9889 3245.7367 3479.5841 3539.5131 3557.0748 3686.7325 3701.1712
redmass: 1.0344 4.8155 6.1748 4.0201 4.5614 6.4869 3.3979 4.5559 5.0834 4.3240 4.3320 4.5489 3.1254 3.3538 5.2685 3.7875 4.5763 1.1742 2.7471 1.3168 1.2320 3.2536 3.4841 1.8720 3.3350 1.5325 2.3619 3.0464 2.8819 1.1931 3.4569 6.7086 6.1086 3.2336 1.1301 4.6267 1.5284 3.7711 4.1140 1.3389 2.8329 2.4657 1.3603 2.4773 1.4402 2.7968 2.2178 1.4728 1.4982 2.3571 2.1100 2.5957 1.5779 1.9463 1.1435 1.7377 1.3179 1.4065 1.8009 1.3585 1.4437 1.5704 2.0249 2.1352 1.2244 1.3324 4.5378 3.5643 1.6277 1.1142 1.0526 1.1138 1.0871 3.6158 4.6370 1.2279 1.2514 7.0482 4.2167 1.0584 1.0624 1.0441 1.0939 1.0957 1.0878 1.0960 1.0988 1.0885 1.0919 1.0939 1.0635 1.0761 1.0452 1.0457 1.1029 1.1034
irintensity: 0.5753 0.7147 0.9983 3.1670 0.9231 0.5308 4.9997 0.6626 1.3593 1.6160 6.5076 0.9957 3.7684 8.3188 11.1538 11.6323 1.1580 70.2674 2.7060 215.0267 135.4737 8.5203 5.7583 15.4736 5.3057 201.5055 29.7985 16.4577 16.6482 66.7704 13.6637 11.4130 25.7464 3.7951 250.0432 22.2957 41.8812 46.3283 5.8396 10.2974 4.7470 7.7660 0.4409 13.4322 12.7344 11.7583 8.3371 3.4576 15.4819 59.6118 5.1752 1.1644 0.3628 5.8225 65.5223 18.1761 47.3520 17.1973 5.1388 14.9345 32.0859 7.7181 36.4216 28.6027 3.0081 103.9648 3.3924 136.2977 31.9104 61.1747 12.1930 46.5366 63.3846 396.1379 1.9692 163.7818 63.0951 204.3044 614.3714 57.1344 79.4528 94.4644 22.4992 31.6536 66.4492 29.5838 20.7539 22.5428 11.5369 18.4782 240.7687 113.6351 35.4891 27.8250 25.5058 24.4609
temp: 298.150 k
press: 1.00000 atm
elementType: 35 8 7 7 7 7 6 6 6 6 6 6 6 6 6 6 6 1 1 1 1 1 1 1 1 1 1 1 1 1 1 1 1 1
symmnumber: 1
zpe: 721336.3 jmol-1
zpe.correction: 0.274742 hartree
zpe.thermalcorrener: 0.292824 hartree
zpe.thermalcorrenthalpy: 0.293768 hartree
zpe.thermalcorrgfe: 0.225562 hartree
zpe.sumelectzpe: -735.766928 hartree
zpe.sumelectthermal: -735.748846 hartree
zpe.sumelectthermalent: -735.747902 hartree
zpe.sumelectthermalfe: -735.816108 hartree
dipole: 7.8205 4.5905 0.2902
dipole: 9.0729
quadrupole: -62.1113 -113.3935 -104.7643
quadrupole: 10.4661 1.9412 -3.1487
quadrupole: 31.3118 -19.9705 -11.3413 10.4661 1.9412 -3.1487
hfenergy: -736.0416702 hartree
pointgroup: C01 [X(C11H17Br1N4O1)]
dipole: 2.9194494 -1.9213741 0.7257714 debye
polarizability: 232.2685251|3.766489|171.6238069|8.3630812|-25.3023991|127.1717226 unknown
InChI: InChI=1S/C11H17BrN4O/c1-7-2-3-10(9(12)4-7)15-5-8(17)6-16-11(13)14/h2-4,8,15,17H,5-6,13-14H2,1H3
charge 0 multiplicity 1
34 atoms
Br -2.632045 2.455396 -1.471756
O  1.90984 2.053548 -0.540121
N  -0.44135 0.79191 0.108226
N  3.735466 0.198091 -0.34405
N  5.057645 -1.222717 -1.661327
N  5.597702 -1.009954 0.613126
C  1.868387 1.307541 0.721717
C  0.777876 0.210504 0.661954
C  3.275838 0.695632 0.967007
C  -1.662157 0.138112 0.0697
C  -2.809857 0.704353 -0.569323
C  -1.864459 -1.141801 0.676439
C  -4.246658 -1.193967 0.0279
C  -4.059865 0.068879 -0.595796
C  -3.120634 -1.779759 0.655422
C  -5.608849 -1.867121 0.02698
C  4.753955 -0.626319 -0.434979
H  1.610465 2.041164 1.506196
H  1.147033 -0.642188 0.047472
H  0.595238 -0.167048 1.689436
H  3.215421 -0.09754 1.747996
H  3.942636 1.500058 1.34603
H  -0.282982 1.604038 -0.49854
H  -1.017602 -1.639298 1.158967
H  -4.899064 0.556641 -1.103669
H  -3.223662 -2.760785 1.135581
H  2.560724 1.513965 -1.093399
H  -6.096165 -1.8009 -0.963264
H  -5.525367 -2.936584 0.289573
H  -6.295181 -1.399755 0.760293
H  4.411402 -1.02696 -2.423103
H  6.021957 -1.448032 -1.897405
H  6.139877 -1.868919 0.560151
H  5.538334 -0.533085 1.507869
