program: QuantumEspresso
programVersion: 6.3
elementType: V O C H Li
lattice: 7.106464 0.000000 0.000000 angstrom
lattice: 0.000000 38.554863 0.000000 angstrom
lattice: 0.000000 0.000000 11.715006 angstrom
elementType: V
elementType: O
elementType: C
elementType: H
elementType: Li
formula: C54H44LiO86V24
209 atoms
Li 3.361797 8.659786 11.707902
C  5.87006 26.438938 11.569941
C  6.269119 27.660548 10.737605
C  3.988305 27.605043 10.984628
O  5.026601 28.411325 10.64137
H  7.027171 28.292422 11.223838
H  6.577164 27.406896 9.710128
H  6.149815 26.533816 12.630645
O  2.823898 27.92248 10.855826
O  4.419003 26.4195 11.475561
H  6.25152 25.484653 11.181959
C  4.539684 27.057389 3.651883
C  5.27529 25.945368 4.399732
C  3.00697 25.682834 4.640194
O  4.197532 25.03633 4.768564
H  5.991944 25.394991 3.772274
H  5.75914 26.2924 5.32771
H  4.538788 26.91788 2.56011
O  1.945414 25.209412 4.989661
O  3.162995 26.911171 4.109545
H  4.882105 28.07004 3.900502
C  2.19164 26.417929 8.072753
C  1.832521 27.769647 7.43195
C  4.1202 27.544425 7.504489
O  3.121826 28.408021 7.222191
H  1.337803 27.667723 6.453303
H  1.229637 28.415972 8.086764
H  1.775325 25.563016 7.520057
O  5.299848 27.780522 7.352567
O  3.638375 26.356698 7.967549
H  1.930791 26.366942 9.140254
C  2.962149 30.43756 1.358129
C  3.547295 31.238258 0.194753
C  5.248728 30.222427 1.326476
O  4.971996 31.253062 0.490597
H  3.404795 30.732496 -0.77461
H  3.195509 32.278037 0.144423
H  2.147002 29.756824 1.069143
O  6.360107 29.849759 1.628549
O  4.102307 29.646513 1.794477
H  2.637498 31.070001 2.202261
O  2.62765 15.229776 14.553633
C  1.884886 14.998559 13.447578
O  1.174733 14.020155 13.303826
C  3.053001 19.668656 13.013239
C  2.632403 18.523187 12.242438
C  2.432058 18.428989 10.851368
C  1.99937 17.232269 10.309915
C  1.802252 16.072793 11.084499
C  2.043146 16.136624 12.474113
C  2.404223 17.369572 13.014977
H  2.603869 19.295278 10.213519
H  1.820225 17.16448 9.235122
H  2.539441 17.433208 14.097411
H  2.586491 14.438901 15.157873
C  1.405126 14.837883 10.329534
O  1.797147 13.703962 10.560097
O  0.605456 15.171788 9.303318
H  0.357629 14.339293 8.792756
H  2.842624 19.524022 14.076554
C  3.704258 20.83979 12.761159
C  4.156404 21.371529 11.457746
C  4.116019 21.809564 13.763506
C  4.725659 22.94076 13.033153
O  4.740364 22.622232 11.660981
O  5.220967 23.967155 13.428371
O  4.117585 20.896914 10.344758
C  4.065681 21.90569 15.126882
C  3.672418 21.008327 16.195325
C  3.80204 19.601912 16.191189
C  3.391816 18.860364 17.29549
C  3.186405 21.627108 17.364446
C  2.747589 20.897985 18.469381
C  2.851052 19.499012 18.414896
H  4.365171 22.899379 15.487089
H  3.114114 22.720216 17.386141
C  2.217991 21.615287 19.671245
H  2.513014 18.903005 19.269523
H  3.504667 17.771424 17.287017
H  4.27387 19.091623 15.348616
O  6.167328 15.259956 15.172026
C  5.607034 14.970741 13.978255
O  5.075228 13.903695 13.720636
C  6.751439 19.730163 13.542874
C  6.280628 18.551567 12.832103
C  5.995391 18.454727 11.457846
C  5.59269 17.251976 10.905039
C  5.468718 16.071457 11.653554
C  5.71823 16.144497 13.047492
C  6.087716 17.377492 13.59861
H  6.103274 19.322672 10.813037
H  5.39021 17.210028 9.833258
H  6.270498 17.41657 14.675184
H  6.223811 14.419586 15.711127
C  5.173734 14.831293 10.842667
O  5.683845 13.734235 10.987978
O  4.330545 15.131999 9.834881
H  4.16995 14.32012 9.274198
H  6.677803 19.607499 14.627345
C  7.293237 20.935353 13.162495
C  7.615617 21.362526 11.76648
C  7.731999 22.03779 14.014514
C  8.331766 23.05978 13.119027
O  8.240209 22.602278 11.794595
O  8.847941 24.121619 13.361493
O  7.441626 20.818759 10.699809
C  7.643506 22.4332 15.326272
C  7.121821 21.877198 16.551868
C  7.044189 20.510219 16.889236
C  6.500887 20.126244 18.10549
C  6.693992 22.825624 17.510174
C  6.113665 22.450295 18.72173
C  6.011284 21.078798 19.001676
H  8.014827 23.460514 15.457748
H  6.834968 23.887148 17.285674
C  5.669158 23.490748 19.710535
H  5.573974 20.763645 19.954147
H  6.46194 19.06453 18.368662
H  7.500791 19.757628 16.242993
H  1.661635 22.517175 19.374542
H  4.925012 24.175429 19.272107
H  6.52284 24.116114 20.026756
H  5.238419 23.0356 20.6138
H  3.042647 21.933927 20.326449
H  1.549509 20.988451 20.276981
V  -0.169923 2.829309 8.042953
V  1.608351 1.81954 10.454362
V  1.611357 1.801806 13.930519
V  -0.169749 2.818772 16.338568
O  1.607329 2.367082 8.431913
O  -0.16939 2.243663 10.011855
O  -0.169282 2.214842 14.37506
O  1.608292 2.354353 15.951591
O  -0.165404 4.408978 16.390441
O  1.64063 0.220705 13.933405
O  1.623347 0.238675 10.441562
O  1.604498 2.261093 12.19528
O  -0.169299 2.257233 6.334663
O  -0.170681 4.420378 7.982062
V  -0.167828 7.213406 8.077569
V  1.592833 6.161765 10.442201
V  1.596744 6.230686 13.905508
V  -0.176498 7.240778 16.292058
O  1.597707 6.736797 8.481986
O  -0.169535 6.652286 10.121585
O  -0.172857 6.7250 14.242644
O  1.589973 6.781525 15.888911
O  -0.186586 8.831863 16.247728
O  1.564692 4.644422 13.870628
O  1.598438 4.576222 10.497814
O  1.734953 6.732053 12.158359
O  -0.17533 6.846245 6.329987
O  -0.146942 8.803803 8.161461
V  -0.162337 11.486675 8.062072
V  1.653395 10.832525 10.537094
V  1.598419 10.744803 13.914528
V  -0.189249 11.512906 16.381834
O  1.639399 11.213876 8.506469
O  -0.160345 11.02656 10.089494
O  -0.189265 11.091546 14.35952
O  1.597387 11.149533 15.932169
O  -0.168123 13.100157 16.550424
O  1.706298 9.159854 13.737575
O  1.861865 9.239879 10.692523
O  1.565675 11.350909 12.232548
O  -0.166368 10.934574 6.36463
O  -0.210468 13.079673 7.91842
V  3.382172 2.835763 8.044875
V  5.158526 1.812389 10.448594
V  5.154601 1.798597 13.93576
V  3.381251 2.83076 16.338707
O  5.158682 2.373054 8.430184
O  3.382565 2.262276 10.017746
O  3.381528 2.257537 14.366267
O  5.157133 2.364893 15.952424
O  3.375727 4.420909 16.383154
O  5.124859 0.220127 13.971519
O  5.143816 0.234347 10.407201
O  5.163015 2.235866 12.194324
O  3.382685 2.269419 6.335146
O  3.382221 4.427162 7.997363
V  3.378936 7.192351 8.060611
V  5.169209 6.17896 10.447243
V  5.163327 6.235158 13.90556
V  3.378974 7.207175 16.301541
O  5.165158 6.765266 8.488974
O  3.37728 6.685716 10.077662
O  3.37878 6.667047 14.31639
O  5.167982 6.772548 15.887004
O  3.381756 8.79633 16.304975
O  5.199588 4.649522 13.86047
O  5.167061 4.593446 10.507476
O  5.020533 6.746389 12.161793
O  3.386432 6.76294 6.326155
O  3.362052 8.781299 8.078216
V  3.413831 11.632491 8.067548
V  5.142196 10.778851 10.542604
V  5.120974 10.760103 13.931122
V  3.347245 11.632047 16.357832
O  5.154677 11.12745 8.50045
O  3.412625 11.333766 10.125466
O  3.354331 11.250363 14.320567
O  5.123823 11.20392 15.939337
O  3.293225 13.225199 16.420177
O  5.021566 9.170458 13.794988
O  4.925873 9.186537 10.68858
O  5.179042 11.308451 12.233408
O  3.372347 11.116548 6.356651
O  3.484231 13.226257 7.995703
fermiener: 0.8477 electronvolt
totalener: -94503.015046 electronvolt
hubbardener: 87.724999 electronvolt
