program: QuantumEspresso
programVersion: 6.3
elementType: V O C H Li
lattice: 7.106464 0.000000 0.000000 angstrom
lattice: 0.000000 38.554863 0.000000 angstrom
lattice: 0.000000 0.000000 11.715006 angstrom
elementType: V
elementType: O
elementType: C
elementType: H
elementType: Li
formula: C52H40LiO86V24
203 atoms
Li -0.975352 25.194622 12.079632
C  2.372804 22.985134 8.752613
C  3.022092 24.02861 9.672478
C  0.748833 24.144391 9.858012
O  1.880536 24.812373 10.136009
H  3.498308 23.585602 10.559033
H  3.720339 24.710483 9.163621
H  2.694748 21.958636 8.974898
O  -0.352342 24.502692 10.259099
O  0.952979 23.078113 9.08731
H  2.470187 23.217509 7.681329
C  4.64353 26.528231 4.977849
C  5.149727 25.1758 5.483476
C  2.858554 25.255189 5.62005
O  3.956094 24.592431 6.078935
H  5.493228 24.519097 4.668251
H  5.928841 25.249582 6.258541
H  5.020203 26.790669 3.980533
O  1.720525 24.909346 5.858789
O  3.204364 26.336483 4.885212
H  4.823803 27.34996 5.691298
C  1.234637 27.817038 7.568118
C  0.721438 27.878118 9.006772
C  3.017476 27.897385 9.004377
O  1.926034 28.207876 9.756133
H  -0.035628 28.657086 9.1837
H  0.337995 26.912391 9.375567
H  1.132082 28.779886 7.038992
O  4.15806 27.927255 9.401058
O  2.651766 27.543631 7.737262
H  0.803372 27.00435 6.966322
C  2.248941 26.782821 1.079158
C  2.747312 28.075166 1.728262
C  4.516141 26.859832 0.980798
O  4.19052 27.863008 1.815291
H  2.578801 28.967573 1.10493
H  2.368411 28.234638 2.74685
H  1.467433 26.936987 0.321899
O  5.667801 26.498161 0.779873
O  3.447672 26.295968 0.406791
H  1.941192 26.012969 1.805576
O  3.084329 15.000894 14.497821
C  2.24697 14.661023 13.499106
O  1.770126 13.553177 13.353379
C  1.491358 19.418016 13.782892
C  1.551138 18.327763 12.849267
C  1.176173 18.350989 11.489744
C  1.180387 17.173121 10.764901
C  1.543779 15.920677 11.310581
C  1.91995 15.883703 12.672036
C  1.894585 17.076708 13.392625
H  0.846671 19.277623 11.017671
H  0.872628 17.196399 9.718793
H  2.122706 17.0283 14.457319
H  3.270792 14.196581 15.082958
C  1.492517 14.724287 10.385915
O  2.002983 13.63476 10.589195
O  0.809568 15.049222 9.275175
H  0.68155 14.228351 8.696378
H  1.577499 19.081398 14.818427
C  1.305249 20.775886 13.633353
C  1.609437 21.524103 12.41291
C  0.837314 21.732325 14.624159
C  0.712716 23.016633 13.901385
O  1.225269 22.879533 12.620487
O  0.194245 24.079315 14.214644
O  2.178598 21.232204 11.385437
C  0.458879 21.747753 15.953765
C  0.235589 20.80847 17.037989
C  0.257184 19.390117 16.992258
C  -0.06888 18.609893 18.106438
C  -0.129665 21.383008 18.2847
C  -0.452004 20.608607 19.394836
C  -0.430547 19.210926 19.309893
H  0.228725 22.774745 16.270745
H  -0.159636 22.474429 18.366897
H  -0.714347 21.094573 20.33923
H  -0.703596 18.598985 20.174954
H  2.97534 16.734137 17.388424
H  0.549402 18.867066 16.084822
O  6.787484 15.036422 14.72091
C  5.962841 14.72054 13.704502
O  5.465383 13.621456 13.545803
C  5.196166 19.52426 14.151528
C  5.120264 18.347389 13.190918
C  4.571232 18.364169 11.910616
C  4.61241 17.213375 11.122912
C  5.101164 15.97856 11.58382
C  5.623066 15.948106 12.897575
C  5.688956 17.146729 13.618451
H  4.105344 19.268545 11.511553
H  4.207759 17.258147 10.110098
H  6.168957 17.100443 14.597563
H  6.946395 14.214278 15.292034
C  5.068968 14.801233 10.629055
O  5.617559 13.722284 10.785969
O  4.35982 15.12254 9.526666
H  4.276522 14.311456 8.935736
C  4.853959 20.902614 13.645661
C  5.291957 21.532251 12.440404
C  4.315162 21.873626 14.483979
C  4.338585 23.173845 13.812249
O  4.9252 23.007383 12.570724
O  3.967784 24.266446 14.211418
O  5.891008 21.208271 11.439543
C  3.9123 21.675575 15.807482
C  3.920857 20.395506 16.330576
C  4.57657 19.251158 15.606909
C  3.948089 17.934718 15.923168
C  3.394151 20.113583 17.61904
C  3.141158 18.826537 18.023266
C  3.330734 17.733516 17.118142
H  3.539694 22.512855 16.401978
H  3.0937 20.956269 18.24961
H  2.716176 18.63768 19.014013
H  -0.049103 17.518787 18.017631
H  4.105688 17.086657 15.255956
H  5.50354 19.170091 16.253214
H  6.286158 19.585512 14.351597
V  0.196886 2.896394 7.915985
V  1.972385 1.846549 10.315126
V  1.975404 1.84954 13.80944
V  0.200185 2.905573 16.203737
O  1.974158 2.432675 8.295741
O  0.196277 2.284212 9.874396
O  0.198877 2.291757 14.246153
O  1.976429 2.439108 15.824155
O  0.200098 4.493917 16.250762
O  1.979994 0.271887 13.857371
O  1.971985 0.268921 10.27182
O  1.971079 2.266707 12.06252
O  0.19742 2.348819 6.201902
O  0.192513 4.484799 7.868438
V  0.192418 7.222029 7.925935
V  1.968947 6.239542 10.326361
V  1.969904 6.241366 13.768758
V  0.191938 7.222247 16.166686
O  1.967646 6.784661 8.32639
O  0.191965 6.666533 9.918267
O  0.192194 6.667247 14.176267
O  1.969111 6.79335 15.765926
O  0.187067 8.814582 16.133096
O  1.969212 4.651057 13.748001
O  1.969524 4.649275 10.35301
O  1.969673 6.717917 12.04731
O  0.19206 6.802079 6.189179
O  0.19592 8.814723 7.953336
V  0.191525 11.466059 7.876292
V  1.971438 10.628568 10.316848
V  1.972971 10.628956 13.745519
V  0.201507 11.462181 16.190811
O  1.974312 11.124066 8.306346
O  0.192183 11.061076 9.896792
O  0.197852 11.058005 14.175626
O  1.980038 11.087379 15.7670
O  0.226435 13.063858 16.323106
O  1.980699 9.040655 13.714418
O  1.975819 9.039969 10.348724
O  1.968408 11.10359 12.028625
O  0.192665 10.925862 6.17708
O  0.177552 13.065743 7.730284
V  3.752197 2.898885 7.919855
V  5.526503 1.844581 10.316222
V  5.527653 1.850997 13.809492
V  3.752922 2.908581 16.201794
O  5.526868 2.424441 8.294665
O  3.750525 2.288016 9.877996
O  3.75172 2.303952 14.241099
O  5.52831 2.440279 15.824199
O  3.75088 4.496686 16.247409
O  5.522719 0.273374 13.857343
O  5.524943 0.266838 10.277429
O  5.527394 2.269076 12.062659
O  3.751173 2.349182 6.201442
O  3.754493 4.486997 7.873635
V  3.744279 7.219496 7.92217
V  5.521331 6.239983 10.326416
V  5.522399 6.236978 13.769447
V  3.747265 7.22102 16.171305
O  5.522548 6.791143 8.327318
O  3.745044 6.667928 9.91588
O  3.746751 6.667223 14.178762
O  5.523288 6.786016 15.766516
O  3.753521 8.81323 16.160261
O  5.524451 4.646711 13.749009
O  5.521562 4.649649 10.350057
O  5.520654 6.714032 12.048606
O  3.744942 6.784057 6.189071
O  3.740667 8.811421 7.929283
V  3.752876 11.522679 7.899978
V  5.524582 10.622351 10.325215
V  5.52332 10.644349 13.746472
V  3.746758 11.512004 16.179627
O  5.519714 11.096604 8.311327
O  3.750593 11.0722 9.910418
O  3.745756 11.079989 14.160884
O  5.522439 11.120207 15.764098
O  3.724449 13.119183 16.232926
O  5.514729 9.056452 13.708212
O  5.518552 9.03457 10.375015
O  5.532583 11.129479 12.032192
O  3.75176 11.034922 6.181522
O  3.776863 13.126079 7.841906
fermiener: 1.7117 electronvolt
totalener: -94124.231772 electronvolt
hubbardener: 87.608563 electronvolt
