program: QuantumEspresso
programVersion: 6.3
elementType: V O C H Li
lattice: 7.106464 0.000000 0.000000 angstrom
lattice: 0.000000 38.554863 0.000000 angstrom
lattice: 0.000000 0.000000 11.715006 angstrom
elementType: V
elementType: O
elementType: C
elementType: H
elementType: Li
formula: C52H40LiO86V24
203 atoms
Li 2.196293 9.764453 6.261972
C  6.084938 25.735154 10.964871
C  6.545763 27.094924 10.441288
C  4.263927 27.077476 10.655991
O  5.339538 27.901495 10.541533
H  7.337991 27.559232 11.047907
H  6.835384 27.073499 9.378045
H  6.314287 25.582422 12.029994
O  3.115353 27.466988 10.606039
O  4.638955 25.789134 10.819059
H  6.460639 24.882286 10.384957
C  4.938853 26.481481 3.995808
C  5.47038 25.280568 4.784407
C  3.182751 25.137029 4.594816
O  4.295233 24.433539 4.9342
H  6.243536 24.714882 4.242364
H  5.828175 25.547004 5.791793
H  5.170115 26.440005 2.922976
O  2.053978 24.69956 4.710547
O  3.49039 26.367406 4.144203
H  5.24886 27.44933 4.4105
C  2.411196 26.28673 7.748455
C  2.000417 27.680908 7.242632
C  4.294342 27.522932 7.259804
O  3.266058 28.379344 7.083821
H  1.494901 27.659773 6.263324
H  1.385876 28.243637 7.961888
H  1.994494 25.46988 7.141326
O  5.465073 27.810883 7.125416
O  3.856367 26.274825 7.588371
H  2.191644 26.132303 8.815383
C  3.324307 29.527004 1.439334
C  3.896682 30.502162 0.410062
C  5.618024 29.384763 1.407194
O  5.318467 30.511434 0.715241
H  3.770682 30.139677 -0.622698
H  3.517118 31.52821 0.506459
H  2.542983 28.865683 1.036733
O  6.737174 29.003426 1.666452
O  4.485619 28.723934 1.787293
H  2.957964 30.020727 2.35532
O  6.936169 14.579154 14.279745
C  6.091278 14.295183 13.273839
O  5.598078 13.192302 13.091949
C  5.738312 19.167241 13.76384
C  5.493982 17.987325 12.835516
C  4.923058 18.059244 11.568869
C  4.807598 16.916918 10.78343
C  5.215137 15.649461 11.221192
C  5.763605 15.555129 12.519028
C  5.939383 16.732987 13.25446
H  4.572325 18.996865 11.142775
H  4.380075 17.016542 9.7847
H  6.431708 16.640004 14.221691
H  7.095839 13.758246 14.839383
C  5.145145 14.520085 10.231569
O  5.742996 13.458846 10.314803
O  4.37717 14.859533 9.176525
H  4.33454 14.082375 8.54714
C  5.537778 20.546333 13.225694
C  5.875902 21.100105 11.915965
C  5.216048 21.612638 14.043811
C  5.279909 22.859655 13.244103
O  5.651185 22.511748 11.954899
O  5.068577 24.001146 13.575453
O  6.318794 20.618271 10.896643
C  4.866721 21.541363 15.394367
C  4.666026 20.281105 15.93659
C  5.137111 19.038488 15.233169
C  4.413225 17.814822 15.625319
C  4.064591 20.114291 17.220814
C  3.61907 18.889392 17.651285
C  3.723778 17.744697 16.796853
H  4.622143 22.445063 15.957819
H  3.875514 21.0118 17.819289
H  3.138408 18.801877 18.631166
H  3.261404 16.800062 17.098907
H  4.514394 16.914218 15.018203
H  6.140389 18.923234 15.848101
H  6.846196 19.064757 13.972337
O  3.2400 14.777046 14.106566
C  2.443453 14.432894 13.066109
O  2.019958 13.300592 12.91197
C  2.313779 19.403095 12.906409
C  1.812655 18.096093 12.303097
C  1.108756 18.028135 11.104994
C  1.012113 16.818684 10.428894
C  1.52174 15.611311 10.931999
C  2.083057 15.63592 12.231799
C  2.263537 16.885539 12.841955
H  0.655406 18.917061 10.666078
H  0.536761 16.809099 9.448495
H  2.812906 16.896703 13.783206
H  3.426807 13.953269 14.64592
C  1.513332 14.440762 9.986374
O  2.053455 13.357615 10.152918
O  0.875489 14.777334 8.846885
H  0.815015 13.970621 8.256547
C  2.220163 20.617671 12.020067
C  2.545405 20.743884 10.582679
C  1.930772 21.867577 12.477201
C  1.962301 22.813438 11.327549
O  2.356504 22.086937 10.201293
O  1.69189 23.984377 11.281532
O  2.945553 19.935702 9.773954
C  1.585021 22.190773 13.817108
C  1.478804 21.176602 14.731785
C  1.939866 19.759595 14.418648
C  1.217971 18.728309 15.207402
C  1.012904 21.432724 16.064513
C  0.657883 20.414021 16.897387
C  0.654134 19.044195 16.423554
H  1.36744 23.226557 14.096906
H  0.934559 22.478165 16.381703
H  0.298133 20.626363 17.908836
H  0.361698 18.241583 17.109956
H  1.30608 17.681344 14.913259
H  2.937306 19.755731 14.946752
H  3.394351 19.197615 12.962052
V  0.381238 2.396128 7.430198
V  2.166378 1.339667 9.819541
V  2.165162 1.321938 13.315392
V  0.385305 2.386048 15.700753
O  2.165646 1.954993 7.812709
O  0.387204 1.781681 9.388168
O  0.387883 1.773099 13.744352
O  2.164878 1.923003 15.323189
O  0.369078 3.975459 15.717499
O  2.164151 -0.255546 13.367496
O  2.168472 -0.237497 9.75681
O  2.165992 1.742461 11.569715
O  0.391998 1.85996 5.712017
O  0.341508 3.987703 7.407595
V  0.415678 6.69231 7.419372
V  2.163896 5.771118 9.856199
V  2.165214 5.801741 13.276185
V  0.396652 6.74009 15.69147
O  2.163637 6.164127 7.813687
O  0.398302 6.232586 9.430163
O  0.392029 6.24719 13.691078
O  2.161889 6.27088 15.300324
O  0.471546 8.337395 15.767851
O  2.171656 4.214843 13.222595
O  2.165852 4.184985 9.935184
O  2.165736 6.31199 11.560022
O  0.367976 6.234238 5.699276
O  0.617276 8.290797 7.345433
V  0.358793 11.196128 7.445246
V  2.162748 10.327801 9.86718
V  2.169813 10.27848 13.306353
V  0.391795 11.070614 15.758512
O  2.164875 10.787873 7.844175
O  0.36924 10.743004 9.418723
O  0.383647 10.696233 13.750415
O  2.178797 10.712916 15.317209
O  0.381734 12.660754 15.929496
O  2.174201 8.691213 13.255079
O  2.182549 8.740789 9.872729
O  2.154737 10.77107 11.587119
O  0.531296 10.523849 5.770774
O  0.339485 12.776636 7.224898
V  3.950286 2.393788 7.430952
V  5.719428 1.331014 9.824343
V  5.718716 1.324587 13.307388
V  3.945147 2.384588 15.700423
O  5.719515 1.89678 7.80753
O  3.94512 1.783181 9.388043
O  3.942794 1.770195 13.744837
O  5.719014 1.899316 15.324697
O  3.960248 3.974101 15.712786
O  5.719476 -0.253434 13.334682
O  5.718088 -0.246483 9.792157
O  5.71923 1.771098 11.567241
O  3.939814 1.859012 5.710933
O  3.988735 3.984597 7.412688
V  3.910918 6.686672 7.411204
V  5.714813 5.839681 9.847348
V  5.714439 5.832609 13.279222
V  3.928079 6.729706 15.702296
O  5.715966 6.436235 7.841864
O  3.927114 6.236751 9.425917
O  3.933979 6.257791 13.695233
O  5.716586 6.38051 15.277673
O  3.848371 8.322768 15.827171
O  5.708996 4.245755 13.234725
O  5.713432 4.252384 9.884262
O  5.715153 6.340268 11.560062
O  3.963249 6.195352 5.702615
O  3.711038 8.284869 7.290531
V  3.948463 11.278309 7.46744
V  5.708387 10.286394 9.85346
V  5.719991 10.278269 13.304974
V  3.949949 11.159366 15.731586
O  5.699302 10.756657 7.789574
O  3.946185 10.782708 9.44193
O  3.951944 10.711175 13.728737
O  5.713679 10.672378 15.398419
O  3.971538 12.756711 15.778823
O  5.71165 8.689663 13.277541
O  5.692773 8.697508 9.842028
O  5.734852 10.726676 11.573504
O  3.799576 10.677169 5.766771
O  3.976362 12.871584 7.361644
fermiener: 0.7803 electronvolt
totalener: -94123.232725 electronvolt
hubbardener: 87.686915 electronvolt
