program: QuantumEspresso
programVersion: 6.3
elementType: V O C H Li
lattice: 7.106464 0.000000 0.000000 angstrom
lattice: 0.000000 38.554863 0.000000 angstrom
lattice: 0.000000 0.000000 11.715006 angstrom
elementType: V
elementType: O
elementType: C
elementType: H
elementType: Li
formula: C52H40LiO86V24
203 atoms
Li 1.442174 10.597832 6.706638
C  4.263488 23.344198 8.581915
C  4.336472 24.742338 9.19098
C  2.176701 24.298543 8.54226
O  3.021985 25.297779 8.892856
H  4.463305 24.738407 10.283989
H  5.095503 25.388283 8.729305
H  4.670248 22.560207 9.235943
O  0.989348 24.44379 8.35649
O  2.836142 23.113959 8.429333
H  4.728564 23.293896 7.583935
C  5.004517 26.602844 3.972914
C  5.512158 25.743949 5.140108
C  3.257715 25.418029 4.864916
O  4.363246 24.924916 5.485374
H  6.344176 25.082686 4.855445
H  5.777963 26.335516 6.032133
H  5.376884 26.256474 2.997725
O  2.134959 25.00889 5.074888
O  3.564474 26.409211 4.004743
H  5.202758 27.676483 4.103998
C  1.585772 27.931654 6.628739
C  1.125957 27.944825 8.087432
C  3.411281 28.093498 8.005439
O  2.335596 28.346415 8.793878
H  0.32729 28.670912 8.302299
H  0.833505 26.944884 8.448896
H  1.378131 28.877004 6.09891
O  4.563242 28.147744 8.372984
O  3.026552 27.782115 6.735758
H  1.200801 27.078486 6.05287
C  2.7920 27.179068 0.458651
C  3.279264 28.625632 0.365368
C  5.091296 27.2296 0.413322
O  4.705861 28.518819 0.626721
H  3.145244 29.052393 -0.641298
H  2.838536 29.288421 1.123804
H  2.057161 26.903487 -0.311805
O  6.239082 26.84575 0.405458
O  4.014157 26.42077 0.233612
H  2.397887 26.90235 1.449023
O  2.155985 15.093579 15.104672
C  1.803294 14.778357 13.842271
O  1.396335 13.674705 13.514291
C  3.161221 19.399976 13.766772
C  2.639221 18.359406 12.917474
C  2.401478 18.396586 11.532305
C  1.970207 17.25078 10.889511
C  1.77398 16.020587 11.546753
C  1.976851 15.973334 12.949052
C  2.37781 17.147637 13.585924
H  2.573586 19.316127 10.971794
H  1.79865 17.287586 9.812931
H  2.530512 17.116241 14.665533
H  2.290788 14.262543 15.634121
C  1.431319 14.870378 10.636209
O  1.818767 13.717508 10.746284
O  0.694589 15.315453 9.603108
H  0.455701 14.547674 9.002126
H  3.170968 19.081438 14.812287
C  3.691078 20.645722 13.591804
C  3.82242 21.420395 12.333909
C  4.196639 21.502233 14.654944
C  4.595868 22.776315 14.01525
O  4.377904 22.662649 12.629243
O  5.079468 23.77655 14.481366
O  3.531162 21.149037 11.189608
C  4.314644 21.393117 16.013883
C  4.141796 20.265286 16.916594
C  4.51884 18.939897 16.606986
C  4.323421 17.906246 17.516543
C  3.630449 20.519925 18.202049
C  3.427841 19.485163 19.112488
C  3.754683 18.171418 18.767825
H  4.565611 22.342999 16.508638
H  3.33262 21.536937 18.47076
H  3.008944 19.716615 20.096785
H  3.58226 17.351805 19.472477
H  4.618882 16.886076 17.250455
H  5.010355 18.725722 15.655403
O  6.162183 15.495523 14.549725
C  5.397368 15.331395 13.443388
O  4.629802 14.399948 13.289204
C  6.780216 19.979114 12.963961
C  6.256541 18.843658 12.231785
C  5.95243 18.757472 10.857649
C  5.50168 17.560389 10.325505
C  5.320971 16.401728 11.10159
C  5.606249 16.469465 12.482971
C  6.059588 17.680514 13.005997
H  6.079126 19.633616 10.221115
H  5.294248 17.506105 9.255761
H  6.286173 17.718793 14.074389
H  6.078422 14.689159 15.131607
C  4.922935 15.151527 10.368625
O  5.342684 14.028354 10.592955
O  4.087996 15.454263 9.354544
H  3.879191 14.617397 8.836148
H  6.808984 19.771314 14.036296
C  7.281778 21.214965 12.65478
C  7.362067 21.853048 11.306601
C  7.830136 22.18456 13.592804
C  8.229057 23.369463 12.782719
O  7.92324 23.111677 11.434947
O  8.759465 24.39677 13.114311
O  7.021393 21.445427 10.217781
C  7.994113 22.322342 14.951031
C  7.775277 21.495019 16.120442
C  7.813763 20.08312 16.16888
C  7.589966 19.399753 17.357096
C  7.563299 22.185413 17.342911
C  7.307173 21.500416 18.525087
C  7.30746 20.103016 18.531598
H  8.337475 23.335264 15.212384
H  7.625004 23.276877 17.35656
H  7.159392 22.059017 19.453461
H  7.111542 19.562107 19.462789
H  7.65112 18.307013 17.371681
H  8.088471 19.513432 15.280306
V  -0.134734 2.80413 8.048626
V  1.648937 1.748815 10.434293
V  1.648604 1.757254 13.925686
V  -0.136875 2.802428 16.310885
O  1.648044 2.356569 8.425254
O  -0.130996 2.1848 10.002298
O  -0.131645 2.192483 14.354851
O  1.647202 2.358566 15.935782
O  -0.169211 4.390901 16.313395
O  1.656245 0.179707 13.98025
O  1.655445 0.170998 10.38605
O  1.644918 2.172816 12.178868
O  -0.126907 2.286508 6.321972
O  -0.165004 4.392861 8.030243
V  -0.094355 7.242019 7.97848
V  1.649252 6.289454 10.427936
V  1.643763 6.300565 13.854694
V  -0.116766 7.249546 16.28582
O  1.652719 6.731338 8.392225
O  -0.11393 6.756478 9.992762
O  -0.124611 6.757658 14.28278
O  1.64622 6.768606 15.881166
O  -0.021162 8.840384 16.421155
O  1.638311 4.71457 13.798176
O  1.639544 4.70432 10.503118
O  1.649573 6.822981 12.138187
O  -0.14749 6.699079 6.282965
O  0.072718 8.837965 7.819113
V  -0.252729 11.885118 8.023342
V  1.547194 10.890343 10.410594
V  1.551645 10.853258 13.876656
V  -0.262869 11.767906 16.257181
O  1.531992 11.370873 8.379451
O  -0.234641 11.364678 9.992383
O  -0.255041 11.253208 14.283282
O  1.542203 11.382147 15.872192
O  -0.400046 13.358311 16.273248
O  1.555741 9.265471 13.880957
O  1.528156 9.303354 10.37729
O  1.55848 11.266776 12.14411
O  -0.115744 11.306883 6.303886
O  -0.258394 13.480102 7.914512
V  3.431887 2.804162 8.043514
V  5.198211 1.748464 10.441928
V  5.19845 1.75361 13.914204
V  3.432284 2.801295 16.31653
O  5.200995 2.306937 8.420139
O  3.425541 2.201372 10.004744
O  3.425945 2.206398 14.355352
O  5.200558 2.29725 15.941012
O  3.462889 4.389312 16.340337
O  5.190694 0.175502 13.924018
O  5.190109 0.170314 10.432613
O  5.20079 2.214063 12.176989
O  3.419605 2.263922 6.323913
O  3.462864 4.392735 8.004742
V  3.406922 7.260512 8.003493
V  5.209973 6.337571 10.41465
V  5.198362 6.341308 13.858924
V  3.402686 7.275122 16.274515
O  5.211443 6.954752 8.417152
O  3.420328 6.739243 9.999243
O  3.412905 6.749592 14.276457
O  5.19617 6.917026 15.857962
O  3.298312 8.869937 16.332144
O  5.20126 4.754919 13.831027
O  5.21674 4.751174 10.449552
O  5.206915 6.831328 12.132229
O  3.440484 6.779334 6.281966
O  3.25722 8.854401 7.950922
V  3.339513 11.804997 8.013007
V  5.113817 10.880128 10.420731
V  5.104515 10.761187 13.860304
V  3.356363 11.665481 16.299962
O  5.110418 11.365843 8.345043
O  3.339542 11.306993 9.970619
O  3.353982 11.246033 14.30226
O  5.115703 11.159717 15.944162
O  3.468598 13.249638 16.444329
O  5.119488 9.17483 13.785273
O  5.147411 9.293338 10.415637
O  5.095328 11.314145 12.154236
O  3.178103 11.143805 6.325961
O  3.34085 13.39516 7.840276
fermiener: 0.7083 electronvolt
totalener: -94125.294211 electronvolt
hubbardener: 87.675950 electronvolt
