program: Gaussian 09
title: 000006962
version: EM64L-G09RevD.01
frameworkgroup: C1[X(C8H6O7S)]
method: RPBEPBE
basis: SDD
operation: Freq
keyword: #pfreq=noraman
keyword: PBEPBE/SDD
title: #p freq=noraman PBEPBE/SDD
converged: YES YES NO NO
title: Mulliken charges:
elementType: S O O O O O O O C C C C C C C C H H H H H H
charge: 0.995536 -0.565160 -0.486373 -0.492166 -0.407968 -0.426038 -0.214229 -0.216527 -0.040716 0.244948 -0.362173 0.192233 -0.223930 -0.300163 0.102838 0.124337 0.314762 0.294476 0.290142 0.388336 0.393775 0.394062
chargesum: 0.00000
title: Mulliken charges with hydrogens summed into heavy atoms:
elementType: S O O O O O O O C C C C C C C C
charge: 0.995536 -0.176824 -0.486373 -0.492166 -0.014193 -0.031975 -0.214229 -0.216527 -0.040716 0.244948 -0.047412 0.192233 0.070546 -0.010021 0.102838 0.124337
polarizability: 1.88645304e+02 1.63057667e+00 1.43165363e+02 1.64219334e+00 -6.31390322e+00 8.09261788e+01
1716.lowfreq: -8.8317 -0.0022 -0.0022 -0.0007 3.4078 8.1291 27.6748 30.1895 61.5164
frequency: 27.3289 30.1203 61.5117 89.2052 97.5009 119.3011 152.5123 167.0338 174.2074 204.3943 210.1436 256.7720 284.5917 315.9334 329.8582 359.5396 365.5162 392.8798 428.3095 468.2456 519.8841 550.2378 566.9134 591.2661 595.8567 604.3583 632.3375 678.2869 713.5315 725.8099 792.8875 801.4009 841.0776 868.5175 937.9769 972.7978 995.5992 1003.7562 1029.4864 1048.7953 1074.2689 1109.3516 1155.6794 1168.1457 1258.9531 1307.2577 1319.1790 1379.5941 1400.9775 1466.1292 1574.5485 1598.1773 1648.0459 1650.9300 3162.8029 3164.9432 3189.1223 3482.6009 3528.3608 3528.8449
redmass: 10.2446 10.9274 7.1783 10.7410 8.9808 4.8151 7.4497 6.7420 2.1601 6.7752 3.5700 6.4589 3.7349 7.7420 9.0823 7.2420 9.0733 7.9288 3.8623 6.0046 3.8894 5.0469 2.5403 2.0803 2.2972 2.3485 5.3095 3.6135 5.1700 7.0529 4.0953 6.6785 12.1800 1.4756 1.4932 17.6543 1.4762 4.8076 4.3253 1.1923 2.0853 2.1502 1.6547 1.5556 1.3472 2.4147 2.5480 6.5127 4.5836 2.8541 7.7741 7.6366 9.7532 9.6014 1.0932 1.0910 1.0959 1.0662 1.0643 1.0643
irintensity: 1.1249 0.3963 0.1585 0.8762 0.5875 3.3564 2.7623 8.9498 34.8520 4.4694 16.2574 18.7906 60.6141 11.6818 5.5315 1.3816 25.0267 55.3078 13.6897 18.3312 76.4944 63.8115 52.0915 73.4547 180.3474 7.5458 53.2086 17.3623 48.0830 54.9129 15.8326 8.7758 62.3409 31.7961 18.5768 94.9499 26.8859 125.7265 309.3083 115.0299 6.2899 53.0724 45.9068 64.4271 6.4159 62.6895 82.9122 4.4014 37.0667 20.3810 27.1139 8.9541 312.8128 124.9879 9.0423 4.6623 0.2838 52.6130 43.6147 66.8249
temp: 298.150 k
press: 1.00000 atm
elementType: 16 8 8 8 8 8 8 8 6 6 6 6 6 6 6 6 1 1 1 1 1 1
symmnumber: 1
zpe: 353936.7 jmol-1
zpe.correction: 0.134807 hartree
zpe.thermalcorrener: 0.150811 hartree
zpe.thermalcorrenthalpy: 0.151756 hartree
zpe.thermalcorrgfe: 0.089840 hartree
zpe.sumelectzpe: -1231.739884 hartree
zpe.sumelectthermal: -1231.723880 hartree
zpe.sumelectthermalent: -1231.722936 hartree
zpe.sumelectthermalfe: -1231.784852 hartree
dipole: 2.9457 -2.8504 2.9876
dipole: 5.0722
quadrupole: -93.6655 -96.4998 -104.1073
quadrupole: -6.0887 -4.1218 7.7672
quadrupole: 4.4254 1.5911 -6.0165 -6.0887 -4.1218 7.7672
hfenergy: -1231.8746911 hartree
pointgroup: C01 [X(C8H6O7S1)]
dipole: -1.1010486 1.1277892 1.2239561 debye
dipolederiv: 2.0547434 -0.0892132 0.0645906 -0.1698715 1.2084682 -0.0377264 0.1475428 -0.0526065 1.6198432 -0.5665951 -0.0198754 -0.2394862 0.0128443 -0.5388719 0.0697548 -0.3225519 0.068302 -0.9622053 -0.6878149 0.0503201 0.0074863 0.0991579 -0.5656788 -0.1148285 0.0077739 -0.0288176 -0.5003993 -0.7392724 -0.0406793 0.0440867 -0.0488097 -0.5577914 0.1095654 0.0194413 0.0301377 -0.4946369 -0.7958739 0.0188989 0.4377606 -0.052568 -0.3525435 0.0787428 0.502445 0.1406366 -0.8097727 -0.4994822 0.3386758 0.162585 0.3956464 -1.0575283 -0.2868375 0.2252427 -0.283303 -0.5164705 -0.4821063 -0.1597496 0.1021974 -0.1080103 -0.8668026 -0.3130603 0.1642765 -0.0899041 -0.5665362 -0.9321545 -0.1166345 -0.2203088 0.0163227 -0.6281792 -0.1724074 -0.1134312 -0.2004008 -0.4398802 0.053517 -0.0137879 -0.0009243 0.0457126 -0.0326899 0.001083 0.153441 -0.0127451 -0.1382528 -0.1226905 -0.0401894 0.0388692 -0.3341105 -0.1480834 -0.0057498 -0.0842528 -0.0466257 -0.0129914 -0.2461295 -0.1022131 -0.0040483 0.139458 -0.0897412 -0.0067585 -0.0311511 0.0020061 -0.0495896 -0.3804427 0.1264529 -0.0014924 0.1623123 0.0629799 -0.053203 0.0463947 0.0330871 0.012318 -0.1743578 0.2319403 0.0065612 -0.1733818 -0.0680357 0.0150334 -0.0008033 -0.019598 -0.0668461 -0.1122072 -0.2147528 -0.0165851 0.0769291 0.0045954 0.0041542 0.030877 0.0312286 -0.0857379 1.0660061 0.3818781 -0.5789363 0.445991 1.2160363 0.3094586 -0.5867421 0.0759129 1.0069279 1.6142383 -0.302224 0.1521598 -0.4192932 1.2880538 0.5234497 0.0203636 0.4718727 0.5538656 0.1578928 0.0255311 0.0040588 0.0208713 0.0995692 0.0003914 0.0232807 -0.0015367 0.1478882 0.102954 -0.0538428 0.0030208 -0.0341885 0.1066715 -0.0036664 0.0077973 0.0109308 0.1548079 0.0763636 0.0296605 0.0019462 0.0216674 0.0269312 0.0019576 -0.0285188 -0.0055028 0.1576722 0.1261146 0.048955 0.1078475 0.0498601 0.3434422 -0.0214716 0.004809 0.000468 0.2707512 0.3172741 -0.0639257 0.0018042 -0.0607295 0.1858878 -0.0685184 -0.05976 -0.1226032 0.3540316 0.1700231 -0.0352249 -0.0731928 -0.0858102 0.3633104 -0.0293632 -0.1264741 -0.0009393 0.3652131 unknown
polarizability: 188.5630589|0.7017087|142.851542|-4.0872397|7.5022212|81.3222452 unknown
InChI: InChI=1S/C8H6O7S/c9-7(10)5-2-1-4(16(13,14)15)3-6(5)8(11)12/h1-3,9,11,13H
charge 0 multiplicity 1
22 atoms
S  3.280778 -0.147411 -0.187091
O  3.528001 -0.271227 1.649077
O  3.529267 -1.599073 -0.851291
O  4.054433 1.162671 -0.73322
O  -2.667957 -1.668635 1.124491
O  -3.042188 2.307281 0.499002
O  -1.606724 -2.843753 -0.582173
O  -3.603202 0.360095 -0.638553
C  1.440256 0.208569 -0.065724
C  -0.828653 -0.608554 0.01569
C  0.557549 -0.877728 -0.066936
C  -1.283945 0.741268 0.052947
C  1.03747 1.549062 0.011996
C  -0.348073 1.80583 0.062149
C  -1.732891 -1.806247 0.101933
C  -2.743278 1.062379 -0.065022
H  0.919344 -1.908661 -0.135208
H  1.774124 2.357984 0.006553
H  -0.717816 2.833334 0.097707
H  4.489587 -0.496891 1.815508
H  -3.277835 -2.454919 1.13127
H  -4.008849 2.503428 0.367995
