program: Gaussian 09
title: 000049821
version: EM64L-G09RevD.01
frameworkgroup: C1[X(C18H23NO)]
method: RPBEPBE
basis: SDD
operation: Freq
keyword: #p
keyword: freq=noraman
keyword: PBEPBE/SDD
title: #p freq=noraman PBEPBE/SDD
converged: YES YES NO NO
title: Mulliken charges:
elementType: O N C C C C C C C C C C C C C C C C C C H H H H H H H H H H H H H H H H H H H H H H H
charge: -0.224078 -0.097070 0.117078 0.123974 -0.000218 0.337692 0.325568 -0.515658 -0.525943 -0.557970 -0.553252 -0.470799 -0.453633 -0.674473 -0.371694 -0.352388 -0.422376 -0.437460 -0.450044 0.095595 0.226406 0.221890 0.225586 0.274449 0.223958 0.224721 0.222283 0.223837 0.219715 0.225444 0.221541 0.217219 0.254538 0.170552 0.225346 0.268195 0.162816 0.198792 0.235204 0.204084 0.229000 0.228526 0.203045
chargesum: 0.00000
title: Mulliken charges with hydrogens summed into heavy atoms:
elementType: O N C C C C C C C C C C C C C C C C C C
charge: -0.224078 -0.097070 0.117078 0.123974 -0.000218 0.337692 0.325568 -0.067362 -0.025908 -0.109291 -0.107132 -0.025640 -0.014873 -0.419935 0.024205 0.078622 0.011620 -0.004376 -0.018473 0.095595
polarizability: 2.54187660e+02 5.78015140e-01 2.22611380e+02 1.06912183e+01 2.84901696e+00 1.34704142e+02
1716.lowfreq: -8.3731 -5.0773 0.0002 0.0004 0.0006 5.0292 24.1170 33.8387 46.6485
frequency: 24.0633 33.2036 46.6008 62.4736 81.9990 95.8938 109.0211 128.1438 155.0068 163.0833 184.8503 208.6663 230.5836 258.5321 299.8786 316.6109 325.6686 337.3227 376.0638 414.3447 434.5711 469.5559 559.5675 566.7941 593.8712 609.3533 632.7818 634.9732 671.7038 693.0432 726.4084 748.8639 773.1372 806.2835 844.0657 848.7509 854.4532 866.6728 875.5615 883.7560 894.8471 898.8721 905.5746 926.3338 929.4724 945.7205 971.2342 990.8899 1000.7031 1026.6039 1041.1318 1045.9641 1056.1745 1058.0289 1071.6951 1091.3120 1113.8615 1129.8245 1131.2833 1155.5810 1163.4933 1172.4748 1186.4440 1190.5869 1205.1116 1211.5107 1214.4792 1223.0750 1226.7467 1238.2617 1256.6316 1269.7069 1274.1338 1277.3731 1285.6468 1286.2341 1289.5827 1304.9817 1311.6961 1315.6987 1323.8921 1342.1038 1361.2667 1369.4565 1425.0525 1426.3622 1435.4418 1458.1094 1460.5669 1462.6336 1464.7341 1467.6181 1478.0428 1479.0473 1479.6854 1482.0620 1496.4525 1573.1207 1585.1893 1606.3343 2796.4207 2821.3054 2836.9368 2966.2566 2968.5838 2969.1514 2971.9090 3003.1070 3003.8081 3010.5591 3021.8570 3022.7649 3033.9588 3040.0158 3040.4506 3044.2077 3065.0339 3072.9176 3075.4950 3089.2276 3102.0241 3102.9512 3122.5321
redmass: 5.2069 2.7732 1.7540 3.3725 3.7029 3.0826 2.7325 2.5266 1.9840 3.3148 3.4832 1.9205 2.8817 3.1783 3.8332 3.2120 2.9187 2.7525 5.6547 4.4681 4.4365 3.9661 3.0632 3.1763 2.9740 2.2933 2.0394 2.9290 4.5633 3.1427 2.6948 3.2808 2.2994 2.4585 2.0831 1.7985 2.2686 2.8745 1.4912 1.5286 3.6617 2.5424 1.7127 2.2979 2.2494 2.3683 1.5653 2.0222 2.6749 2.4175 1.6682 1.8373 3.1718 3.3517 2.5301 1.5624 2.9530 1.2434 1.1969 1.8934 1.3094 1.5849 1.2854 1.3551 1.3537 1.3498 1.4888 2.0437 1.1796 1.9243 1.3984 1.5522 1.4573 1.6416 1.2616 1.2359 1.3411 2.6572 1.4326 1.4699 1.8709 1.4951 1.5400 4.6370 3.1108 4.0643 1.4014 1.0878 1.0892 1.0934 1.0816 1.1163 1.0880 1.1019 1.0992 1.0812 1.1009 7.8836 8.6156 8.1087 1.0691 1.0716 1.0708 1.0655 1.0657 1.0659 1.0712 1.0642 1.0646 1.0596 1.0812 1.0734 1.0803 1.0942 1.0954 1.0933 1.1047 1.1020 1.1042 1.1028 1.0912 1.0918 1.0921
irintensity: 1.8684 0.4995 0.2461 0.1592 1.4965 0.4810 0.0140 0.0988 0.2275 3.6228 0.5820 4.3646 0.6061 4.0849 2.6068 4.4967 0.6989 7.5143 1.4071 2.1710 3.0669 4.6175 0.4058 5.6989 5.5141 3.2011 2.0300 0.1546 0.4409 1.1276 6.6535 3.9176 2.7898 4.5100 0.2303 9.2580 5.7499 13.9941 7.4264 4.4257 1.1767 14.3776 18.3016 2.0720 5.9324 0.9078 2.6156 3.5289 0.2585 6.9043 1.2599 18.7603 52.2683 13.1561 23.9001 2.8298 41.8425 9.6191 1.0318 68.9429 0.0363 10.1541 4.0189 10.7705 7.7524 4.4144 5.0753 24.1655 2.7148 6.2034 9.0916 25.1439 5.0724 9.6770 1.3663 4.0429 2.9758 13.4787 1.0831 3.3002 3.6572 2.4294 7.3567 30.1075 7.4704 24.3801 13.2188 10.2487 10.7535 6.9692 2.0446 10.6989 12.9566 3.9409 10.1374 0.5789 4.0831 67.3690 59.2896 10.8404 68.8825 59.1210 188.0389 39.5233 13.5229 67.9282 24.0670 51.6284 30.1653 24.6435 1.2788 95.9826 52.5098 40.9711 20.2594 41.1095 0.0956 48.5083 50.5226 59.2969 8.1548 20.1629 15.1217
temp: 298.150 k
press: 1.00000 atm
elementType: 8 7 6 6 6 6 6 6 6 6 6 6 6 6 6 6 6 6 6 6 1 1 1 1 1 1 1 1 1 1 1 1 1 1 1 1 1 1 1 1 1 1 1
symmnumber: 1
zpe: 966545.6 jmol-1
zpe.correction: 0.368138 hartree
zpe.thermalcorrener: 0.386472 hartree
zpe.thermalcorrenthalpy: 0.387416 hartree
zpe.thermalcorrgfe: 0.320072 hartree
zpe.sumelectzpe: -828.192487 hartree
zpe.sumelectthermal: -828.174153 hartree
zpe.sumelectthermalent: -828.173209 hartree
zpe.sumelectthermalfe: -828.240554 hartree
dipole: 1.1003 2.9494 1.0041
dipole: 3.3043
quadrupole: -108.5682 -114.8617 -120.6067
quadrupole: -4.4322 0.9734 -2.0119
quadrupole: 6.1107 -0.1828 -5.9278 -4.4322 0.9734 -2.0119
hfenergy: -828.5606252 hartree
pointgroup: C01 [X(C18H23N1O1)]
dipole: 0.3598794 1.0339629 0.7009954 debye
polarizability: 254.1797611|0.0444612|214.3602646|9.6270994|26.2335761|142.9631558 unknown
InChI: InChI=1S/C18H23NO/c20-17(12-19-9-1-2-10-19)18-15-7-3-5-13(15)11-14-6-4-8-16(14)18/h11H,1-10,12H2
charge 0 multiplicity 1
43 atoms
O  -0.961099 -1.291089 -1.295581
N  -3.102782 -0.402117 0.311249
C  1.136434 1.288003 0.302201
C  1.741134 -1.019581 -0.229563
C  0.729248 -0.013471 -0.127868
C  2.488604 1.545078 0.657134
C  3.080993 -0.748793 0.154823
C  0.329384 2.583114 0.438387
C  1.614043 -2.479074 -0.663808
C  2.675997 2.994587 1.08436
C  3.943467 -1.997455 0.03054
C  1.418622 3.696324 0.495269
C  3.091318 -2.926019 -0.884891
C  3.464327 0.529421 0.608162
C  -4.08963 0.127161 1.290614
C  -3.841434 -0.462988 -0.980063
C  -1.835607 0.331224 0.29988
C  -5.395132 -0.630299 0.936125
C  -5.232249 -1.014878 -0.57535
C  -0.695916 -0.38239 -0.456605
H  -0.380277 2.746538 -0.391993
H  -0.266745 2.577249 1.374021
H  1.131097 -3.072167 0.140468
H  0.985369 -2.599196 -1.557725
H  2.687997 3.07215 2.191152
H  3.6221 3.433694 0.719929
H  4.947891 -1.790278 -0.381515
H  4.092748 -2.457152 1.029357
H  1.097456 4.573023 1.084307
H  1.640457 4.042102 -0.531521
H  3.36801 -2.752047 -1.941597
H  3.246763 -3.997638 -0.670449
H  4.501223 0.734367 0.900958
H  -4.242625 1.232042 1.167877
H  -3.748862 -0.055732 2.325835
H  -3.299702 -1.098402 -1.695133
H  -3.945456 0.561286 -1.427732
H  -1.950419 1.353679 -0.155044
H  -1.505487 0.495329 1.343293
H  -6.285433 -0.003532 1.119473
H  -5.489559 -1.539445 1.553792
H  -5.258396 -2.110991 -0.695785
H  -6.031771 -0.588036 -1.205983
