program: QuantumEspresso
programVersion: 6.3
elementType: O C H
lattice: 10.659696 0.000000 0.000000 angstrom
lattice: 0.000000 33.554837 0.000000 angstrom
lattice: 0.000000 0.000000 11.715006 angstrom
elementType: O
elementType: C
elementType: H
formula: C20H12O7
39 atoms
O  3.946198 15.133954 11.951194
C  3.424889 15.492825 13.127226
O  3.747038 15.013257 14.178735
C  2.516104 20.2151 14.313387
C  2.088072 18.966556 13.571632
C  0.914582 18.934649 12.824593
C  0.514242 17.767365 12.203931
C  1.284761 16.611111 12.294672
C  2.48633 16.650317 13.002845
C  2.865837 17.819965 13.643656
H  0.299893 19.822082 12.74201
H  -0.415811 17.736745 11.653624
H  3.793692 17.829846 14.203421
H  4.525089 14.379505 12.117921
C  0.793218 15.329624 11.736975
O  1.239588 14.247283 12.010497
O  -0.248729 15.48948 10.904184
H  -0.508376 14.604236 10.622744
C  2.632167 21.385884 13.401499
C  3.664164 21.651368 12.39859
C  1.68236 22.335055 13.295465
C  2.102938 23.266241 12.217676
O  3.305209 22.817626 11.725191
O  1.55559 24.234454 11.799242
O  4.658279 21.053594 12.134663
C  0.473511 22.341443 14.043984
C  0.353455 21.434715 15.049757
C  1.562127 20.618032 15.464713
C  1.252407 19.469184 16.363395
C  -0.856885 21.272466 15.795933
C  -0.995463 20.284302 16.704958
C  0.066292 19.340489 16.963711
H  -0.321784 23.031962 13.795079
H  -1.684269 21.936008 15.57257
H  -1.936218 20.165032 17.228634
H  -0.119973 18.51423 17.63819
H  2.043221 18.749363 16.541402
H  2.149371 21.331208 16.07367
H  3.487508 20.003387 14.765569
fermiener: -4.3926 electronvolt
totalener: -6390.875804 electronvolt
