program: Orca
programVersion: 5.0.3
elementType: O C O C C C C C C C H H H H C O O H H C C C C O O O C C C C C C C H H C H H H H H H
charge: 0
multiplicity: 1
keywords: PBE0 def2-TZVPP
formula: C21H14O7
InChI: InChI=1/C21H14O7/c1-11-3-2-4-12(7-11)9-16-17(21(27)28-20(16)26)10-13-5-6-14(18(22)23)15(8-13)19(24)25/h2-10,22,24H,1H3
42 atoms
O  0.595939 15.280814 14.353662
C  1.353774 15.056717 13.267328
O  1.786501 13.969381 12.994185
C  1.425535 19.946632 13.060987
C  1.70808 18.716499 12.351152
C  2.286593 18.602037 11.080918
C  2.50505 17.356675 10.523883
C  2.153099 16.194085 11.195859
C  1.608912 16.286218 12.479495
C  1.397647 17.53618 13.038355
H  2.554521 19.493013 10.534215
H  2.953297 17.278735 9.541584
H  0.987427 17.594845 14.038189
H  0.515313 14.433441 14.80747
C  2.384868 14.89996 10.484039
O  3.465279 14.520874 10.130299
O  1.240619 14.269768 10.201034
H  1.477348 13.440507 9.766558
H  1.13637 19.760221 14.090027
C  1.408985 21.257009 12.728542
C  1.571549 21.871067 11.388085
C  0.996229 22.345811 13.604896
C  0.741844 23.509859 12.727012
O  1.131835 23.172334 11.44962
O  0.307948 24.587672 12.981138
O  1.985697 21.430427 10.360426
C  0.819795 22.508927 14.92966
C  1.134826 21.637538 16.049469
C  2.239577 20.78363 16.058673
C  2.516601 20.023394 17.180262
C  0.342899 21.722053 17.19884
C  0.595985 20.947265 18.321372
C  1.69629 20.092817 18.296155
H  0.380622 23.468032 15.194926
H  -0.496492 22.40937 17.205664
C  -0.277681 21.036403 19.538439
H  1.921772 19.487424 19.166998
H  3.383631 19.374305 17.188922
H  2.897396 20.741855 15.200396
H  -1.090867 21.747766 19.396042
H  0.294483 21.352745 20.413537
H  -0.719539 20.067133 19.780277
totalener: -1334.29353979 hartree
nucrepener: 2394.81189408 hartree
electener: -3729.10543387 hartree
oneelecener: -6578.91773488 hartree
twoeener: 2849.81230101 hartree
kineticenergy: 1328.67463133 hartree
exchangeener: -128.545103499339 hartree
correlationener: -6.644024335856 hartree
xcener: -135.189127835195 hartree
chargesum: -0.0000000
charge: -0.266370 0.305896 -0.311193 -0.030826 0.067695 -0.161567 -0.106302 0.083146 -0.064381 -0.088406 0.155985 0.143236 0.122204 0.221166 0.265622 -0.297611 -0.254351 0.226220 0.115425 -0.128072 0.289992 -0.025449 0.276426 -0.150322 -0.263537 -0.271698 -0.038184 0.109444 -0.224286 -0.114486 -0.150730 0.028073 -0.140116 0.123208 0.103868 -0.262367 0.121621 0.134164 0.153936 0.091411 0.106717 0.104799
charge: 0.368671 -0.432118 0.135939 0.060788 -0.074620 0.061044 0.030713 -0.026380 -0.069338 0.056204 0.011800 0.036345 0.031098 -0.092265 -0.448247 0.135443 0.381685 -0.089249 0.043481 -0.086476 -0.393811 -0.088591 -0.403122 0.346226 0.162047 0.173113 0.067719 -0.092444 0.005963 -0.009327 0.026122 -0.080181 0.009517 0.046466 0.026911 0.022741 0.024767 0.023902 0.029032 0.020642 0.024185 0.023605
qa: -0.2664 0.3059 -0.3112 -0.0308 0.0677 -0.1616 -0.1063 0.0831 -0.0644 -0.0884 0.1560 0.1432 0.1222 0.2212 0.2656 -0.2976 -0.2544 0.2262 0.1154 -0.1281 0.2900 -0.0254 0.2764 -0.1503 -0.2635 -0.2717 -0.0382 0.1094 -0.2243 -0.1145 -0.1507 0.0281 -0.1401 0.1232 0.1039 -0.2624 0.1216 0.1342 0.1539 0.0914 0.1067 0.1048
va: 2.1973 4.3104 2.1788 3.6806 3.8058 3.9795 3.9875 3.7517 3.8281 3.9031 1.0447 1.0055 1.0375 1.0377 4.3963 2.2013 2.2100 1.0329 1.0159 3.6441 4.2857 3.6130 4.3141 2.2258 2.2464 2.2112 3.7782 3.6596 4.0079 3.9948 3.9725 3.8402 3.9952 1.0250 1.0176 3.9261 1.0012 0.9990 0.9965 1.0120 0.9991 0.9995
energy: 25804.9 31199.6 31940.7 32788.7 33594.9 35340.9 35893.3 36633.4 37759.3 38196.7 39352.6 39746.7 41396.2 41659.1 42084.6 42812.4 43132.2 43671.9 44027.2 44325.3 44701.6 44955.6 45583.0 45822.5 46796.2 47189.9 47782.7 48472.6 48532.7 48843.1 48986.8 49017.7 49594.5 49618.9 50326.9 51142.1 51486.2 52021.9 52358.3 52661.3 53068.0 53189.7 53573.5 54261.0 54439.3 54639.8 54931.9 55138.1 55477.0 55607.1 55868.4 55926.4 56051.7 56083.0 56250.5 56654.6 56861.7 57069.3 57352.5 57873.1 57960.6 58113.7 58426.4 58700.8 58782.8 59000.3 59094.5 59171.9 59276.6 59532.0 59670.9 59794.1 59811.1 59919.5 60097.6 60603.2 60740.3 60812.4 61012.4 61234.5 61369.5 61508.0 61576.9 61697.0 61810.8 61863.8 62135.0 62250.0 62446.1 62619.9 62909.9 62950.3 63024.9 63151.4 63294.3 63368.1 63510.2 63637.7 63686.9 63945.7
energy: -1334.175964072522
dipole: -3.97190 3.20343 -0.76847 1.73955 -2.70828 -0.96873 26.18347 -23.61140 2.57207
magnitude: 2.85386 au
magnitude: 7.25394 debye
