program: Orca
programVersion: 5.0.4
elementType: C C C C C C C C C O C C O O C C C C C C C H H H H H H H H H H H H
charge: 0
multiplicity: 1
keywords: wB97X-D3BJ def2-TZVPP
formula: C18H12O3
InChI: InChI=1/C18H12O3/c19-17-15(11-13-7-3-1-4-8-13)16(18(20)21-17)12-14-9-5-2-6-10-14/h1-12H
33 atoms
C  -5.120511 0.730027 0.925952
C  -5.442918 -0.171286 -0.080377
C  -4.534251 -0.419829 -1.102999
C  -3.305839 0.224355 -1.113593
C  -2.972462 1.127583 -0.102773
C  -3.897019 1.387037 0.907598
C  -1.68838 1.857461 -0.145465
C  -0.457204 1.345661 -0.234252
C  0.693134 2.273334 -0.426035
O  1.823524 1.513575 -0.646197
C  0.108288 -0.014538 -0.218262
C  1.550654 0.156561 -0.548932
O  0.728244 3.463721 -0.417508
O  2.425004 -0.634182 -0.727912
C  -0.568137 -1.137019 0.090845
C  -0.230656 -2.556763 0.213363
C  -1.327539 -3.42507 0.324764
C  -1.151124 -4.793346 0.445621
C  0.134178 -5.31961 0.485432
C  1.230928 -4.469538 0.405642
C  1.058251 -3.100986 0.26576
H  -5.826395 0.930057 1.723459
H  -6.402786 -0.67415 -0.072236
H  -4.786076 -1.11188 -1.89815
H  -2.594594 0.035298 -1.909476
H  -3.651231 2.102476 1.684446
H  -1.740662 2.943083 -0.123225
H  -1.618874 -0.961897 0.289887
H  -2.329912 -3.009515 0.315595
H  -2.012713 -5.446289 0.518846
H  0.281671 -6.388825 0.58505
H  2.234641 -4.875948 0.446822
H  1.917489 -2.456089 0.18333
elementType: C O H
totalener: -919.44338543 hartree
nucrepener: 1492.45877232 hartree
electener: -2411.90215774 hartree
oneelecener: -4209.81403048 hartree
twoeener: 1797.91187274 hartree
cpcmener: -0.01666252 hartree
kineticenergy: 915.65599186 hartree
exchangeener: -83.122068815415 hartree
correlationener: -6.065037385878 hartree
xcener: -89.187106201293 hartree
chargesum: 0.0000000
charge: -0.156467 -0.130280 -0.148759 -0.219487 0.078873 -0.171272 0.007849 -0.045087 0.301299 -0.184783 -0.144076 0.321626 -0.309949 -0.305913 0.067383 0.047489 -0.120663 -0.176885 -0.113829 -0.142172 -0.204920 0.150546 0.151825 0.151956 0.160775 0.142897 0.141265 0.116080 0.129213 0.149895 0.152630 0.151285 0.151657
charge: -0.010275 -0.009696 -0.012854 0.005556 -0.090553 0.009317 0.079318 -0.086442 -0.380025 0.314742 -0.089048 -0.368118 0.124816 0.142190 0.086242 -0.084366 0.018201 -0.013861 0.001075 -0.011826 0.026317 0.025960 0.025202 0.026300 0.032765 0.030270 0.044619 0.045903 0.029627 0.025877 0.026771 0.026158 0.009839
qa: -0.1565 -0.1303 -0.1488 -0.2195 0.0789 -0.1713 0.0078 -0.0451 0.3013 -0.1848 -0.1441 0.3216 -0.3099 -0.3059 0.0674 0.0475 -0.1207 -0.1769 -0.1138 -0.1422 -0.2049 0.1505 0.1518 0.1520 0.1608 0.1429 0.1413 0.1161 0.1292 0.1499 0.1526 0.1513 0.1517
va: 3.9663 3.9522 3.9523 3.9473 3.6305 3.9801 3.7926 3.5966 4.3322 2.1827 3.6233 4.2846 2.2213 2.1990 3.6394 3.6894 3.9330 3.9765 3.9563 3.9673 3.9626 0.9940 0.9920 0.9937 0.9934 1.0032 1.0088 1.0176 1.0085 0.9953 0.9913 0.9945 1.0346
energy: 31610.2 39198.8 39796.2 41477.5 41954.4 42515.7 44413.2 48227.0 49556.3 51076.2 51369.3 51692.8 53450.0 54346.3 54785.8 55540.4 56020.8 56639.9 57989.3 58852.6 59351.2 60103.6 60183.6 60334.1 60592.0 61271.3 61991.4 62131.7 62380.0 63054.4 63733.5 63994.3 64240.6 64850.8 65637.7 65870.6 66170.3 66705.4 67059.9 67252.7 67968.5 68585.7 68646.0 68887.7 69024.9 69630.8 70205.5 70325.0 70926.1 71297.5
dispcorr: -0.085085628 hartree
energy: -919.384444326603
dipole: -14.24302 11.45201 -2.79101 -11.73088 9.91079 -1.82009 2.66532 -2.07763 0.58769
magnitude: 3.38347 au
magnitude: 8.60008 debye
