program: Orca
programVersion: 5.0.3
elementType: C C C C C C C C C O C C O O C C C C C C C H H H H H H H H H H H H
charge: 0
multiplicity: 1
keywords: wB97X-D3BJ def2-TZVPP
formula: C18H12O3
InChI: InChI=1/C18H12O3/c19-17-14-10-12-8-4-5-9-13(12)15(16(14)18(20)21-17)11-6-2-1-3-7-11/h1-10,13,15H
33 atoms
C  -4.938836 0.739532 0.898613
C  -4.584981 -0.624092 1.281868
C  -3.423711 -1.160177 0.906619
C  -2.449536 -0.424731 0.031568
C  -2.730036 1.068018 -0.072817
C  -4.064478 1.533455 0.262879
C  -1.782632 1.902336 -0.548187
C  -0.470957 1.357383 -0.780544
C  0.703091 2.029446 -1.409772
O  1.771372 1.159989 -1.324112
C  -0.084504 0.143683 -0.368295
C  1.361127 -0.0019 -0.660968
O  0.78524 3.106951 -1.907337
O  2.123617 -0.879242 -0.413591
C  -0.985692 -0.776255 0.395817
C  -0.702907 -2.247317 0.164797
C  -0.715039 -2.777912 -1.122831
C  -0.484005 -4.129553 -1.331363
C  -0.236274 -4.969553 -0.25141
C  -0.216131 -4.447274 1.034034
C  -0.448655 -3.092287 1.238275
H  -5.917197 1.119126 1.170024
H  -5.28402 -1.193293 1.883117
H  -3.164725 -2.17606 1.181519
H  -2.60674 -0.805646 -0.992359
H  -4.314114 2.56249 0.029541
H  -1.97685 2.950625 -0.736078
H  -0.834127 -0.567303 1.464199
H  -0.894466 -2.128407 -1.973569
H  -0.490426 -4.528106 -2.339167
H  -0.053004 -6.025127 -0.414103
H  -0.014434 -5.092703 1.881055
H  -0.425478 -2.686704 2.244196
totalener: -919.41491171 hartree
nucrepener: 1563.50738446 hartree
electener: -2482.92229617 hartree
oneelecener: -4351.74577044 hartree
twoeener: 1868.82347428 hartree
kineticenergy: 915.62997441 hartree
exchangeener: -83.134465630583 hartree
correlationener: -6.078740829062 hartree
xcener: -89.213206459645 hartree
chargesum: -0.0000000
charge: -0.081797 -0.121852 -0.247043 0.159783 0.012373 -0.183737 -0.190659 0.014562 0.278022 -0.171317 -0.225051 0.257006 -0.240916 -0.228559 0.270924 0.000027 -0.161082 -0.140677 -0.113832 -0.118027 -0.189807 0.128551 0.127622 0.124802 0.100650 0.116400 0.134329 0.093356 0.113667 0.124683 0.124283 0.123802 0.109515
charge: 0.006469 -0.023702 0.030455 -0.025310 -0.020039 0.002802 0.008626 -0.056808 -0.379486 0.307280 -0.033810 -0.376004 0.168694 0.179883 -0.029004 -0.063211 0.001281 -0.005706 -0.009862 -0.007511 -0.001187 0.021131 0.019098 0.024046 0.058881 0.025012 0.026609 0.053230 0.020509 0.019703 0.018280 0.019296 0.020355
qa: -0.0818 -0.1219 -0.2470 0.1598 0.0124 -0.1837 -0.1907 0.0146 0.2780 -0.1713 -0.2251 0.2570 -0.2409 -0.2286 0.2709 0.0000 -0.1611 -0.1407 -0.1138 -0.1180 -0.1898 0.1286 0.1276 0.1248 0.1006 0.1164 0.1343 0.0934 0.1137 0.1247 0.1243 0.1238 0.1095
va: 3.9543 3.9485 3.9865 3.8421 3.8295 3.9665 3.9399 3.6199 4.3653 2.1771 3.7202 4.3712 2.2750 2.2855 3.7334 3.5621 4.0116 4.0504 4.0064 4.0173 4.0541 0.9978 0.9999 1.0126 1.0082 1.0107 1.0141 1.0098 1.0096 1.0011 0.9996 1.0005 1.0120
energy: 27189.3 34803.1 39181.6 40163.7 41937.4 43163.1 45045.2 45868.1 49715.1 50688.4 51212.9 52822.2 53674.9 54654.0 55358.8 55989.0 56733.1 57002.3 57031.8 57439.8 58870.0 59510.4 60370.4 60821.0 61235.4 61638.1 62086.3 62803.4 63670.4 63803.0 64426.4 64891.0 65008.0 65207.8 65645.0 66041.3 66293.3 66665.4 66715.0 66981.0 67127.7 67408.7 67812.0 68157.1 68819.4 69269.3 69420.0 70017.4 70475.1 70640.7 70951.7 71245.8 71635.0 71701.1 71925.5 72221.2 72402.6 72672.3 72969.0 73081.4 73350.2 73646.6 74033.0 74160.5 74521.0 74642.5 74884.0 75061.8 75282.3 75601.3 76144.0 76393.1 76975.7 77136.6 77360.3 77802.4 77969.8 78447.5 78610.6 78638.9 78764.5 78974.4 79132.0 79339.2 79433.4 79624.5 79803.0 79998.2 80037.3 80385.4 80418.8 80542.3 80666.4 80713.2 81054.3 81259.2 81476.9 81550.5 81818.3 82088.0
dispcorr: -0.089727850 hartree
energy: -919.380756109331
dipole: -13.39265 11.20296 -2.18969 -11.02311 10.19065 -0.83247 5.54285 -4.72254 0.82031
magnitude: 2.48206 au
magnitude: 6.30891 debye
