program: Orca
programVersion: 5.0.4
elementType: C C C C C C C C C O C C O O C C C C C C C H H H H H H H H H H H H
charge: 0
multiplicity: 1
keywords: PBE0 def2-TZVPP
formula: C18H12O3
InChI: InChI=1/C18H12O3/c19-17-15(11-13-7-3-1-4-8-13)16(18(20)21-17)12-14-9-5-2-6-10-14/h1-12H
33 atoms
C  -5.348285 1.106031 0.566778
C  -5.57751 0.018185 -0.262661
C  -4.536388 -0.499655 -1.02286
C  -3.269673 0.047262 -0.934088
C  -3.018884 1.130765 -0.086668
C  -4.085119 1.667477 0.640202
C  -1.716905 1.773384 0.008054
C  -0.473528 1.26561 -0.078778
C  0.658334 2.219822 -0.114381
O  1.808443 1.506615 -0.35633
C  0.113385 -0.066183 -0.161836
C  1.552713 0.153459 -0.431285
O  0.671343 3.40351 0.007813
O  2.443966 -0.602701 -0.666908
C  -0.526936 -1.220192 0.141112
C  -0.164757 -2.618472 0.197291
C  -1.151971 -3.47752 0.709079
C  -0.938978 -4.838273 0.8087
C  0.268876 -5.376953 0.388154
C  1.252087 -4.54458 -0.130671
C  1.046677 -3.180951 -0.229344
H  -6.158638 1.525886 1.149641
H  -6.567141 -0.416413 -0.329621
H  -4.715404 -1.330448 -1.694251
H  -2.468939 -0.348029 -1.545904
H  -3.910499 2.528617 1.27482
H  -1.739034 2.849414 0.16454
H  -1.562131 -1.067399 0.427921
H  -2.097046 -3.055779 1.032807
H  -1.713605 -5.479573 1.210191
H  0.442431 -6.443723 0.460635
H  2.193185 -4.964001 -0.464366
H  1.816652 -2.541721 -0.632765
elementType: C O H
totalener: -918.11099172 hartree
nucrepener: 1489.30649925 hartree
electener: -2407.41749097 hartree
oneelecener: -4204.02114632 hartree
twoeener: 1796.60365535 hartree
cpcmener: -0.01686314 hartree
kineticenergy: 914.04748835 hartree
exchangeener: -91.611573501421 hartree
correlationener: -4.844509779885 hartree
xcener: -96.456083281306 hartree
chargesum: 0.0000000
charge: -0.156890 -0.124828 -0.149015 -0.212982 0.079214 -0.167699 -0.020094 -0.009263 0.301941 -0.176967 -0.133354 0.313869 -0.318108 -0.310241 0.010052 0.048159 -0.129988 -0.175587 -0.109231 -0.140632 -0.197896 0.152302 0.154378 0.154059 0.166012 0.141422 0.128848 0.130812 0.136076 0.151956 0.154658 0.153063 0.155955
charge: -0.010879 -0.003109 -0.011430 0.011114 -0.095220 0.017776 0.069361 -0.089257 -0.400651 0.331891 -0.091397 -0.388846 0.126047 0.146391 0.071998 -0.086881 0.022091 -0.013423 0.004273 -0.011374 0.030538 0.028060 0.027473 0.028553 0.034764 0.032383 0.048191 0.048976 0.031438 0.028092 0.028526 0.028285 0.006247
qa: -0.1569 -0.1248 -0.1490 -0.2130 0.0792 -0.1677 -0.0201 -0.0093 0.3019 -0.1770 -0.1334 0.3139 -0.3181 -0.3102 0.0101 0.0482 -0.1300 -0.1756 -0.1092 -0.1406 -0.1979 0.1523 0.1544 0.1541 0.1660 0.1414 0.1288 0.1308 0.1361 0.1520 0.1547 0.1531 0.1560
va: 3.9735 3.9643 3.9715 3.9757 3.6541 3.9879 3.7606 3.5859 4.3048 2.1917 3.6201 4.2734 2.1988 2.1795 3.6505 3.7476 3.9314 3.9801 3.9590 3.9641 3.9317 0.9937 0.9914 0.9937 0.9931 1.0046 1.0203 1.0056 1.0080 0.9948 0.9912 0.9943 1.0444
energy: 25527.0 31985.0 32623.9 32845.7 35369.1 36281.0 38403.2 40003.6 40802.3 40892.4 42277.4 42798.8 42843.9 43535.9 45382.4 45649.6 46823.9 47912.8 48510.8 49335.3 49666.1 49885.8 50695.2 50754.1 51189.7 52766.0 52846.0 53274.3 53545.2 55185.3 55864.8 56038.1 56283.8 56514.0 56938.9 56974.5 57062.0 57174.7 57521.9 57659.6 57751.0 58057.0 58520.0 58718.6 58957.6 59116.6 59879.7 60062.9 60687.2 60702.2 60980.8 61050.7 61520.6 61557.2 61695.3 61744.2 61846.9 62375.3 62442.7 62629.6 63023.7 63395.8 63686.3 63807.4 63989.2 64337.3 64762.8 64785.3 64910.9 65100.0 65500.8 65854.2 66438.6 66570.2 66704.2 66902.3 67005.4 67173.6 67868.3 67962.8 68270.7 68328.2 68455.4 68561.7 68659.4 68912.7 68981.5 69161.8 69299.9 69519.0 69733.8 69880.2 69910.4 70058.4 70138.2 70336.6 70417.3 70562.6 70666.8 70746.7
energy: -917.994682153540
dipole: -14.16675 11.19684 -2.96990 -11.48887 9.43301 -2.05586 1.59128 -1.19811 0.39317
magnitude: 3.63338 au
magnitude: 9.23532 debye
