program: Orca
programVersion: 5.0.3
elementType: C C C C C C C C C O C C O O C C C C C C C H H H H H H H H H H H H
charge: 0
multiplicity: 1
keywords: M062X def2-TZVPP D3zero
formula: C18H12O3
InChI: InChI=1/C18H12O3/c19-17-15(11-13-7-3-1-4-8-13)16(18(20)21-17)12-14-9-5-2-6-10-14/h1-12H
33 atoms
C  -5.293071 1.160773 0.836835
C  -5.620438 0.127252 -0.030067
C  -4.663522 -0.366819 -0.908825
C  -3.381184 0.156299 -0.907047
C  -3.036399 1.186273 -0.028921
C  -4.015344 1.698103 0.824767
C  -1.706797 1.80193 -0.044972
C  -0.505105 1.233566 -0.209248
C  0.676406 2.128493 -0.366111
O  1.761989 1.352547 -0.696136
C  0.016899 -0.133804 -0.281188
C  1.437319 0.011626 -0.713021
O  0.755017 3.308645 -0.269071
O  2.235616 -0.795381 -1.060972
C  -0.621168 -1.265924 0.065681
C  -0.185526 -2.656798 0.175861
C  -1.187876 -3.630014 0.080227
C  -0.888591 -4.977325 0.184718
C  0.419743 -5.374389 0.423989
C  1.418242 -4.417827 0.558685
C  1.125141 -3.07081 0.430745
H  -6.036504 1.557522 1.514656
H  -6.620607 -0.284029 -0.03205
H  -4.920318 -1.154569 -1.604274
H  -2.642524 -0.21546 -1.605724
H  -3.76538 2.518227 1.486122
H  -1.682446 2.881993 0.072323
H  -1.667191 -1.135873 0.321062
H  -2.212151 -3.316297 -0.083433
H  -1.674018 -5.714469 0.090092
H  0.659549 -6.425122 0.516389
H  2.435223 -4.722316 0.764853
H  1.911737 -2.342553 0.539074
totalener: -918.79036664 hartree
nucrepener: 1488.93866830 hartree
electener: -2407.72903494 hartree
oneelecener: -4202.36594099 hartree
twoeener: 1794.63690605 hartree
kineticenergy: 914.49599292 hartree
xcener: -61.636001857726 hartree
chargesum: -0.0000000
charge: -0.138809 -0.135029 -0.113469 -0.261504 0.034679 -0.133523 -0.056609 -0.043608 0.303851 -0.198117 -0.150597 0.310741 -0.264651 -0.264295 -0.071185 0.091925 -0.129579 -0.157899 -0.122879 -0.142319 -0.137495 0.145750 0.146506 0.147701 0.192122 0.134891 0.152746 0.165193 0.111457 0.140306 0.143331 0.143345 0.157024
charge: -0.006533 -0.003127 -0.012083 0.005630 -0.091539 0.016568 0.062858 -0.086419 -0.396021 0.329541 -0.090831 -0.390377 0.159675 0.170390 0.066677 -0.082323 0.013536 -0.012735 0.000361 -0.004587 0.032910 0.022131 0.021091 0.021862 0.031030 0.026680 0.045517 0.041129 0.022444 0.020186 0.020983 0.022649 0.022726
qa: -0.1388 -0.1350 -0.1135 -0.2615 0.0347 -0.1335 -0.0566 -0.0436 0.3039 -0.1981 -0.1506 0.3107 -0.2647 -0.2643 -0.0712 0.0919 -0.1296 -0.1579 -0.1229 -0.1423 -0.1375 0.1458 0.1465 0.1477 0.1921 0.1349 0.1527 0.1652 0.1115 0.1403 0.1433 0.1433 0.1570
va: 3.9883 3.9925 3.9638 3.9380 3.7778 4.0140 3.7942 3.8039 4.2995 2.1583 3.8100 4.2623 2.2186 2.1842 3.7777 3.7716 3.9973 4.0235 3.9831 4.0183 3.9554 0.9910 0.9895 0.9911 0.9665 0.9983 0.9998 0.9585 1.0060 0.9923 0.9894 0.9920 1.0074
energy: 30227.7 36207.0 37759.7 38897.6 39221.2 40672.5 40926.7 45890.9 46583.1 47209.0 47652.6 49709.3 50709.7 50820.5 51330.8 52311.0 52511.1 53054.0 54771.0 55315.7 55440.1 56127.6 56266.4 56459.4 56861.6 57978.5 58349.7 58894.8 60416.2 60982.5 61470.8 61702.5 61960.5 62147.9 62440.2 62899.8 62984.1 63146.1 63540.2 63755.0 63930.1 64102.5 64429.9 64663.7 64728.0 64899.8 65099.3 65530.2 66032.0 66168.4 66460.0 66567.5 66688.2 67119.2 67735.0 67857.0 68298.5 68399.8 68576.4 68619.6 68906.9 69210.5 69288.6 69337.7 69623.8 69932.9 70607.0 70674.6 70864.4 70962.2 71166.8 71516.4 71738.6 71896.6 72030.1 72246.1 72531.1 72776.1 72988.3 73215.5 73509.9 73620.2 73954.7 74283.0 74321.3 74596.4 74688.2 74859.1 75097.2 75126.1 75552.3 75674.6 75806.8 76042.1 76248.7 76466.5 76594.5 76796.6 76992.8 77151.0
dispcorr: -0.001962735 hartree
energy: -918.654602058663
dipole: -13.77271 11.56678 -2.20594 -10.88161 9.50977 -1.37184 3.02601 -2.44868 0.57733
magnitude: 2.66109 au
magnitude: 6.76396 debye
