program: Gaussian 09
title: 000006961
version: EM64L-G09RevD.01
frameworkgroup: C1[X(C10H6O8)]
method: RPBEPBE
basis: SDD
operation: Freq
keyword: #pfreq=noraman
keyword: PBEPBE/SDD
title: #p freq=noraman PBEPBE/SDD
converged: YES YES NO NO
title: Mulliken charges:
elementType: O O O O O O O O C C C C C C C C C C H H H H H H
charge: -0.405415 -0.427640 -0.405364 -0.427467 -0.211316 -0.223091 -0.211421 -0.223048 0.269717 0.193192 0.269351 0.193646 -0.544050 -0.430890 0.085948 0.114947 0.086026 0.114748 0.296244 0.316667 0.391578 0.393030 0.391571 0.393035
chargesum: 0.00000
title: Mulliken charges with hydrogens summed into heavy atoms:
elementType: O O O O O O O O C C C C C C C C C C
charge: -0.013837 -0.034610 -0.013793 -0.034432 -0.211316 -0.223091 -0.211421 -0.223048 0.269717 0.193192 0.269351 0.193646 -0.247806 -0.114223 0.085948 0.114947 0.086026 0.114748
polarizability: 1.95151484e+02 2.28093439e-03 1.54605130e+02 8.89911106e-03 1.14480320e+01 7.20127622e+01
1716.lowfreq: -4.8078 -2.7989 -0.0009 -0.0008 -0.0006 4.4037 25.5406 26.1642 45.0262
frequency: 25.5259 26.1462 45.0227 84.7907 91.5797 91.7583 125.4904 161.4481 166.4944 172.7923 197.1321 251.6218 290.4249 290.5902 345.2551 348.2454 392.4022 426.5701 446.7758 516.9161 541.2138 555.3594 587.2054 591.7213 592.9653 607.3146 617.1077 639.3608 651.1518 681.4790 704.1047 717.3165 742.4744 754.3417 779.6335 802.6878 919.5538 942.9653 969.1848 1011.5041 1027.9560 1033.1186 1081.9852 1147.4726 1160.2640 1185.9984 1270.9542 1288.9127 1303.6322 1309.3542 1344.0496 1382.2482 1387.8113 1490.5634 1561.5493 1609.9668 1644.9245 1646.1951 1648.8636 1653.1450 3166.4682 3196.6821 3524.2907 3524.4309 3529.2151 3529.4055
redmass: 13.7372 12.0894 8.1622 7.3472 11.4831 10.7880 7.6220 6.4789 6.0394 7.0787 9.4141 8.8032 8.8227 7.6876 6.9015 8.1359 5.9738 4.6587 4.6889 4.3708 2.1435 1.4015 3.5464 1.3257 1.4084 4.3332 2.5936 3.4081 4.4391 3.7944 5.8100 5.8900 5.5280 7.5612 11.5335 3.4816 12.1614 1.5513 1.5146 5.3176 4.4725 3.1673 2.0941 2.4447 1.3628 2.0881 1.2477 3.1958 2.1025 2.4681 4.5243 11.8254 7.8485 3.4688 10.9873 7.4339 9.1638 9.7624 9.4602 9.9270 1.0930 1.0924 1.0642 1.0642 1.0643 1.0643
irintensity: 0.2151 0.2431 0.2994 1.6432 0.5815 0.0107 0.1116 1.9478 4.0422 1.0759 2.9486 1.5907 2.4458 1.1351 6.0696 1.2590 7.5993 12.6109 11.8690 33.2077 123.3620 146.3263 0.1940 249.7733 18.7261 43.1808 1.2792 1.2068 6.2954 46.9439 120.2239 61.0781 13.6709 1.1134 20.0603 2.8771 7.6491 38.9158 36.0308 306.4636 379.0468 263.0427 87.6463 93.1975 81.1392 79.9629 1.0077 29.3512 151.7105 4.1914 138.0916 30.7202 37.7065 6.1367 45.6582 30.7831 308.8825 81.9836 215.7023 297.6909 0.7409 4.3525 74.7518 24.9919 38.5780 75.9018
temp: 298.150 k
press: 1.00000 atm
elementType: 8 8 8 8 8 8 8 8 6 6 6 6 6 6 6 6 6 6 1 1 1 1 1 1
symmnumber: 1
zpe: 398087.8 jmol-1
zpe.correction: 0.151624 hartree
zpe.thermalcorrener: 0.168157 hartree
zpe.thermalcorrenthalpy: 0.169101 hartree
zpe.thermalcorrgfe: 0.105404 hartree
zpe.sumelectzpe: -985.197336 hartree
zpe.sumelectthermal: -985.180803 hartree
zpe.sumelectthermalent: -985.179859 hartree
zpe.sumelectthermalfe: -985.243556 hartree
dipole: 0.0010 3.7875 2.9806
dipole: 4.8196
quadrupole: -92.2655 -92.6310 -107.0072
quadrupole: -0.0061 0.0096 -11.0073
quadrupole: 5.0357 4.6703 -9.7060 -0.0061 0.0096 -11.0073
hfenergy: -985.3489598 hartree
pointgroup: C01 [X(C10H6O8)]
dipole: 0.0002718 -1.4063254 -1.2719159 debye
dipolederiv: -0.7271555 -0.0690618 -0.4546243 -0.0290257 -0.3956193 -0.0123097 -0.5382953 0.0552308 -0.8620554 -0.3329224 -0.0719038 -0.0579217 -0.179144 -1.2175348 -0.2970974 -0.1216645 -0.313297 -0.5002046 -0.7276267 0.0691531 0.4542115 0.0288097 -0.3954431 -0.0119449 0.5385773 0.0551998 -0.8618014 -0.3329521 0.0725216 0.0583376 0.1789306 -1.2160289 -0.2976985 0.1218618 -0.3159566 -0.5016139 -0.6194838 0.2770378 0.0381979 0.2220589 -0.718986 -0.3424312 -0.1287756 -0.1428069 -0.6406852 -0.9950413 0.0361455 0.2382721 -0.1035534 -0.6246899 -0.0882529 0.1741028 -0.1422966 -0.4107534 -0.6195646 -0.2765669 -0.0379307 -0.2220962 -0.7192801 -0.3431791 0.1286966 -0.1425182 -0.6405027 -0.9946816 -0.0356984 -0.2398544 0.1035167 -0.6244494 -0.0890167 -0.1731992 -0.1422965 -0.4113947 -0.0971474 0.0848749 -0.0319948 0.3255106 0.0557723 -0.0177451 0.1140861 -0.0242739 -0.0174748 -0.3394353 -0.1815638 0.0200145 -0.2937066 -0.2069492 -0.0450259 -0.0628288 0.0198158 0.0064467 -0.0975477 -0.0851789 0.03199 -0.325206 0.0563419 -0.0178834 -0.114995 -0.0241034 -0.0175209 -0.3392903 0.1814926 -0.0199186 0.2940332 -0.2074229 -0.0450242 0.0622726 0.0199081 0.0063511 -0.3335502 0.0001496 -0.000044 0.0001088 0.0269908 0.0056003 -0.0001519 0.0162038 -0.0967877 -0.0619405 0.0000218 0.000027 0.0001298 -0.0292328 0.0119542 -0.0002822 0.0114339 -0.0570213 1.3171007 -0.4375526 0.4102758 -0.4174668 0.9109607 0.4523295 0.5300094 0.1993134 1.1544578 1.4657245 0.2886428 -0.2831375 0.471414 1.5122799 0.4214549 -0.1676374 0.4102178 0.4925758 1.3176715 0.4370965 -0.4101134 0.4175672 0.9114614 0.4526277 -0.5298014 0.1993625 1.154022 1.465498 -0.2898401 0.2842159 -0.471937 1.5104056 0.4230919 0.1677185 0.4123327 0.4948725 0.1089894 -0.000032 -0.0000243 -0.0000299 0.02883 -0.0000757 0.0001231 -0.0038111 0.1455835 0.1480852 0.0000958 -0.0000347 0.0000597 0.0675346 0.0046515 0.0000014 0.0065495 0.1512639 0.2525239 0.0892024 0.0298339 0.0765881 0.2621943 -0.0760785 0.1158571 -0.1111919 0.334707 0.1450303 -0.0336145 0.0713783 0.024297 0.3754762 -0.0058928 0.1132193 0.0341295 0.3714953 0.2527092 -0.0891667 -0.0297653 -0.0768203 0.2619242 -0.0760433 -0.1156989 -0.1111601 0.3346701 0.1450066 0.033745 -0.0713911 -0.0240385 0.3754645 -0.0060107 -0.1131957 0.0340146 0.3713702 unknown
polarizability: 195.1514807|-0.0124891|152.6540653|0.0109144|16.9821671|73.9638298 unknown
InChI: InChI=1S/C10H6O8/c11-7(12)3-1-4(8(13)14)6(10(17)18)2-5(3)9(15)16/h1-2,11,13,15,17H
charge 0 multiplicity 1
24 atoms
O  -3.281701 1.300997 -1.092792
O  -2.375015 -2.722645 -0.49444
O  3.282497 1.300415 -1.091084
O  2.375268 -2.722535 -0.496795
O  -2.726721 2.520781 0.811183
O  -3.572359 -1.023062 0.542094
O  2.726171 2.520651 0.812091
O  3.571844 -1.024584 0.54338
C  -1.229294 0.760961 0.017488
C  -1.230801 -0.65959 -0.070708
C  1.229692 0.760202 0.018382
C  1.230431 -0.660357 -0.069749
C  0.000373 1.451316 0.087229
C  -0.000378 -1.352512 -0.118751
C  -2.477803 1.599687 0.005349
C  -2.508777 -1.430439 0.024292
C  2.478579 1.598351 0.007213
C  2.507825 -1.432064 0.026551
H  0.000677 2.541736 0.176868
H  -0.000698 -2.442981 -0.170706
H  -4.1210 1.834275 -1.048892
H  -3.233223 -3.212389 -0.378363
H  4.121256 1.834556 -1.047391
H  3.233857 -3.211971 -0.382251
