program: Gaussian 16
title: [B12Cl11(NHCHO)](2-)
version: ES64L-G16RevC.02
frameworkgroup: C1[X(CH2B12Cl11NO)]
method: RB3LYP
basis: def2TZVPP
operation: Freq
keyword: #P
keyword: Geom=AllCheck
keyword: Guess=TCheck
keyword: SCRF=Check
keyword: GenChk
keyword: RB3LYP/def2TZVPP
keyword: Freq
converged: YES YES YES YES
title: Mulliken charges:
elementType: B B B B B B B B B B B B Cl Cl Cl Cl Cl Cl Cl Cl Cl Cl Cl N H C H O
charge: -0.041533 0.138742 0.236151 0.206162 0.042212 0.035146 0.171784 0.050373 0.103034 0.093336 0.094947 0.083386 -0.270858 -0.292108 -0.282053 -0.280811 -0.279931 -0.283765 -0.264645 -0.269989 -0.270130 -0.267405 -0.267702 -0.323498 0.102271 -0.050692 0.105846 -0.018270
chargesum: -2.00000
title: Mulliken charges with hydrogens summed into heavy atoms:
elementType: B B B B B B B B B B B B Cl Cl Cl Cl Cl Cl Cl Cl Cl Cl Cl N C O
charge: -0.041533 0.138742 0.236151 0.206162 0.042212 0.035146 0.171784 0.050373 0.103034 0.093336 0.094947 0.083386 -0.270858 -0.292108 -0.282053 -0.280811 -0.279931 -0.283765 -0.264645 -0.269989 -0.270130 -0.267405 -0.267702 -0.115380 -0.050692 -0.018270
polarizability: 3.14618018e+02 9.32571067e-01 2.96499690e+02 -1.23351795e+00 9.97897567e-01 2.94032630e+02
1716.lowfreq: -2.3032 -0.4577 -0.0025 -0.0018 0.0029 1.4561 24.3955 36.0151 62.8090
frequency: 24.3950 36.0150 62.8090 67.1562 107.5587 112.1623 112.3748 115.3585 116.0553 120.9919 121.3956 122.7612 123.7073 124.6245 125.6822 125.8053 127.1039 127.5227 129.2916 129.5296 143.3350 148.6456 151.8384 159.4298 167.0534 201.4435 231.6884 291.6418 292.0206 292.2574 293.0577 296.9710 310.5276 325.8050 326.0028 402.9229 435.9147 444.8197 445.6024 531.7897 532.7532 579.7172 581.6685 589.7063 592.5808 596.7532 598.0320 666.4315 698.8717 701.5693 709.5137 718.6946 739.0861 744.9670 747.6547 748.1648 758.0237 766.1200 767.8015 781.3860 782.0664 922.7626 925.3015 949.1046 967.6273 979.8062 982.4788 983.9172 1010.6027 1021.3547 1035.8160 1040.2016 1100.0904 1200.9082 1608.7350 2182.1502 3523.5612 3602.8733
redmass: 13.8408 16.1190 12.1752 12.5859 7.5306 34.1226 34.3556 33.0845 33.1959 22.6896 28.4319 26.3917 34.6057 30.7656 31.2593 29.2100 32.4809 31.9647 21.4669 34.4994 2.1937 14.9659 18.7949 13.0099 4.8594 4.4364 3.0031 26.5986 27.9312 25.8264 24.3399 29.8794 26.3395 31.1881 30.7994 9.1221 11.5250 8.2826 8.2877 9.0143 10.5732 6.1691 8.3896 8.0557 10.8457 10.9410 10.4025 2.9284 8.9654 9.6940 11.2050 5.1835 8.2507 9.8436 10.7172 10.8314 5.4766 9.2711 7.1573 10.7280 10.9886 11.4261 11.4167 11.2038 6.2137 11.1970 11.1964 11.2280 11.1076 6.3948 11.2644 11.4480 1.6439 6.8970 1.1075 13.4279 1.0491 1.0926
irintensity: 0.0091 0.2593 0.1048 2.6337 1.8565 0.0167 0.0001 0.0241 0.0170 0.2784 0.1088 0.1567 0.0377 0.1675 0.0710 0.1020 0.0353 0.0456 0.3501 0.0253 8.0808 0.2729 0.2671 0.7245 2.0074 0.3236 6.6266 0.0003 0.0496 0.1067 0.0696 0.0276 0.0999 0.0086 0.0049 9.6053 0.0017 1.1552 4.1046 63.1056 75.4495 70.3255 36.3307 0.6313 0.1189 0.6875 0.0975 94.0916 0.5689 10.2619 0.1243 36.7103 0.3772 0.0080 3.0181 0.1948 33.5602 1.0526 16.1641 0.8733 0.0447 0.0165 0.0594 7.1766 7.2269 0.5483 0.1514 0.7411 144.2962 267.5074 271.5824 75.9385 16.3663 112.5411 41.8235 99.1584 0.5479 8.1882
temp: 298.150 k
press: 1.00000 atm
elementType: 5 5 5 5 5 5 5 5 5 5 5 5 17 17 17 17 17 17 17 17 17 17 17 7 1 6 1 8
symmnumber: 1
zpe: 277916.0 jmol-1
zpe.correction: 0.105853 hartree
zpe.thermalcorrener: 0.135125 hartree
zpe.thermalcorrenthalpy: 0.136069 hartree
zpe.thermalcorrgfe: 0.045096 hartree
zpe.sumelectzpe: -5531.049140 hartree
zpe.sumelectthermal: -5531.019867 hartree
zpe.sumelectthermalent: -5531.018923 hartree
zpe.sumelectthermalfe: -5531.109896 hartree
dipole: 1.6921 0.0594 1.3854
dipole: 2.1877
quadrupole: -289.0809 -281.2873 -275.2444
quadrupole: 0.0345 4.5179 -0.5441
quadrupole: -7.2100 0.5835 6.6265 0.0345 4.5179 -0.5441
hfenergy: -5531.1549923 hartree
pointgroup: C01 [X(C1H2B12Cl11N1O1)]
dipole: -0.6696591 -0.0290829 0.5399507 debye
polarizability: 314.6232292|0.6466675|296.5315289|1.3768847|-0.9412946|293.9955799 unknown
InChI: InChI=1/C.12B.11Cl.N.O.2H
charge -2 multiplicity 1
28 atoms
B  -1.20757008 -0.08789188 1.01727625
B  1.58232039 0.07967476 -0.94718968
B  -1.18037112 -0.68789478 -0.67040561
B  -1.06765688 1.04862759 -0.36120588
B  -0.24746791 -1.52502017 0.58868604
B  -0.06393 1.27494831 1.08766111
B  0.46045193 -0.31261623 1.66405078
B  -0.04845433 0.30657831 -1.61953518
B  0.45081266 -1.29798892 -1.03156714
B  0.63607506 1.53359507 -0.52667735
B  1.46780057 -1.06114127 0.41463514
B  1.58230989 0.68666274 0.72625607
Cl 3.05194211 0.16857966 -1.98485278
Cl -2.64771709 -1.43327305 -1.41104846
Cl -2.41324396 2.17883318 -0.76440796
Cl -0.7454031 -3.15033676 1.20785153
Cl -0.36728055 2.63642792 2.24068331
Cl 0.69917539 -0.64210994 3.42464227
Cl -0.31199441 0.63554996 -3.37046474
Cl 0.72248562 -2.67918571 -2.15600645
Cl 1.10617813 3.17116828 -1.1125709
Cl 2.80825928 -2.19428428 0.82121463
Cl 3.04569381 1.43143975 1.46785742
N  -2.40985929 -0.16026033 1.86257971
H  -2.42313486 0.55084705 2.58088535
C  -5.15084643 -0.54715888 0.88637399
H  -2.52610886 -1.0642757 2.29906628
O  -5.42098196 0.41764133 0.36790923
