program: Gaussian 16
title: Title Card Required
version: ES64L-G16RevA.03
frameworkgroup: C2[C2(CH),X(C8H8)]
method: RMN12L
basis: 6-31G(d)
operation: Freq
keyword: #N
keyword: Geom=AllCheck
keyword: Guess=TCheck
keyword: SCRF=Check
keyword: GenChk
keyword: RMN12L/6-31G(d)
keyword: Freq
converged: YES YES YES YES
title: Mulliken charges:
elementType: C H C C H H C H C C H H C H C C H H
charge: -0.150199 0.298905 -0.104235 -0.104235 0.298326 0.298326 -0.051189 0.292921 -0.385326 -0.209666 0.293561 0.291255 -0.051189 0.292921 -0.209666 -0.385326 0.291255 0.293561
chargesum: 1.00000
title: Mulliken charges with hydrogens summed into heavy atoms:
elementType: C C C C C C C C C
charge: 0.148706 0.194091 0.194091 0.241732 -0.094071 0.083895 0.241732 0.083895 -0.094071
1716.lowfreq: -7.6688 -0.0012 -0.0009 -0.0008 5.1071 22.9645 41.1297 217.9534 343.6325
frequency: 38.7293 217.9505 343.6304 372.3051 424.6383 477.2840 516.2739 626.9239 626.9865 726.7612 740.8225 753.2175 836.5344 855.7646 876.1920 892.4273 921.7060 945.6658 958.3882 964.5712 987.8971 998.6445 1065.4603 1069.5680 1168.1148 1187.9518 1202.3627 1211.1407 1222.4254 1235.1217 1334.8276 1346.7295 1376.5278 1413.1925 1424.2527 1507.3967 1565.5002 1660.7325 1688.7741 3166.5097 3167.1008 3193.8884 3208.0093 3214.4893 3224.3813 3224.5304 3249.7283 3251.3747
redmass: 4.1299 3.3446 3.3797 4.5818 2.7162 2.8731 5.9099 2.2226 5.5670 1.2828 1.8112 1.5216 3.2806 3.5948 2.4876 2.3673 2.9337 2.1101 1.4541 1.4222 2.2448 1.5402 2.0831 1.9584 1.0820 1.3049 1.2686 1.1326 1.1709 1.2895 1.3083 1.2810 1.9667 1.7668 1.5194 2.2473 3.8151 5.4187 6.1428 1.0891 1.0893 1.0854 1.0935 1.0988 1.0885 1.0877 1.1028 1.1041
irintensity: 63.2761 12.8067 0.6268 2.6025 14.1146 12.4516 1.0391 2.2754 5.3454 51.2586 82.1427 5.2232 7.6762 10.7470 6.1970 0.0049 27.5512 8.3020 9.6283 14.5960 0.1161 0.6506 3.0855 1.8819 1.4897 9.6433 0.1543 7.3072 10.7731 7.1236 1.3739 4.7007 8.6776 1.3432 27.0785 0.0005 61.0940 4.8891 5.0140 0.2664 0.0214 7.3591 5.4056 17.1321 17.9073 2.1516 16.3982 1.6808
temp: 298.150 k
press: 1.00000 atm
elementType: 6 1 6 6 1 1 6 1 6 6 1 1 6 1 6 6 1 1
symmnumber: 2
zpe: 398855.3 jmol-1
zpe.correction: 0.151916 hartree
zpe.thermalcorrener: 0.158883 hartree
zpe.thermalcorrenthalpy: 0.159827 hartree
zpe.thermalcorrgfe: 0.120973 hartree
zpe.sumelectzpe: -347.535962 hartree
zpe.sumelectthermal: -347.528995 hartree
zpe.sumelectthermalent: -347.528050 hartree
zpe.sumelectthermalfe: -347.566905 hartree
dipole: 0.0000 -0.0000 0.7361
dipole: 0.7361
quadrupole: -42.0237 -35.1321 -42.0271
quadrupole: 3.3471 0.0000 0.0000
quadrupole: -2.2960 4.5956 -2.2995 3.3471 0.0000 0.0000
hfenergy: -347.6878777 hartree
pointgroup: C02 [C2(C1H1),X(C8H8)]
dipole: 0. 0. 0.2895991 debye
dipolederiv: -0.333366 -0.0638592 0. -0.467643 -0.4993354 0. 0. 0. -0.1909566 0.0710165 -0.1321244 0. -0.0008642 0.1494 0. 0. 0. 0.1410981 0.2953574 0.1559887 -0.1199329 0.1099347 0.2372084 0.0185899 -0.3866572 -0.1179449 0.4594487 0.2953574 0.1559887 0.1199329 0.1099347 0.2372084 -0.0185899 0.3866572 0.1179449 0.4594487 0.1543424 0.0142618 -0.0013607 -0.0300653 0.0979298 -0.0133691 0.0235094 0.0259246 0.0761356 0.1543424 0.0142618 0.0013607 -0.0300653 0.0979298 0.0133691 -0.0235094 -0.0259246 0.0761356 -0.0423456 0.0542487 -0.0056111 0.0388967 -0.0236144 -0.114795 -0.0043544 -0.0207827 -0.2003402 0.0694085 -0.0037281 -0.0386491 -0.0056723 0.108766 0.007664 0.0607892 0.0052698 0.2101909 -0.2308568 -0.0869797 0.2070159 0.0464476 0.2080188 -0.1101553 -0.1050157 0.0099766 0.0022361 0.2139236 -0.0330639 0.198168 0.0508187 -0.0852024 0.0423345 -0.0958506 -0.0616305 -0.2126271 0.0955345 -0.0059316 -0.0297012 0.0348447 0.1029526 0.0482951 -0.0798694 0.0275917 0.0943323 0.0758107 0.0031958 -0.0097283 -0.0109511 0.0289089 0.0163824 -0.0193985 0.0166325 0.0955529 -0.0423456 0.0542487 0.0056111 0.0388967 -0.0236145 0.114795 0.0043544 0.0207827 -0.2003402 0.0694085 -0.0037281 0.0386491 -0.0056723 0.108766 -0.007664 -0.0607892 -0.0052698 0.2101909 0.2139236 -0.0330639 -0.198168 0.0508187 -0.0852024 -0.0423346 0.0958506 0.0616305 -0.2126271 -0.2308568 -0.0869796 -0.2070159 0.0464476 0.2080188 0.1101553 0.1050157 -0.0099766 0.0022361 0.0758107 0.0031958 0.0097283 -0.0109511 0.0289089 -0.0163824 0.0193985 -0.0166325 0.0955529 0.0955345 -0.0059316 0.0297012 0.0348447 0.1029526 -0.0482951 0.0798694 -0.0275917 0.0943323 unknown
polarizability: 74.7264898|7.2154825|93.522218|0.|0.|79.164187 unknown
InChI: InChI=1/9C.9H
charge 1 multiplicity 1
18 atoms
C  0.0000 0.0000 1.74659631
H  0.0000 0.0000 2.83622971
C  0.37300138 1.15122153 1.0795165
C  -0.37300138 -1.15122153 1.0795165
H  -0.9246629 -1.94136322 1.58980843
H  0.9246629 1.94136322 1.58980843
C  -1.21756891 0.70098646 -0.84105155
H  -2.02003248 1.30138428 -1.26318385
C  0.00120587 1.39202016 -0.34263914
C  -1.28150204 -0.63125301 -0.79104636
H  -2.15414447 -1.22864517 -1.04024523
H  0.05049369 2.44962095 -0.6080913
C  1.21756891 -0.70098646 -0.84105155
H  2.02003248 -1.30138428 -1.26318385
C  1.28150204 0.63125301 -0.79104636
C  -0.00120587 -1.39202016 -0.34263914
H  -0.05049369 -2.44962095 -0.6080913
H  2.15414447 1.22864517 -1.04024523
