program: Gaussian 16
title: Title Card Required
version: ES64L-G16RevA.03
frameworkgroup: CS[SG(C3H3),X(C6H6)]
method: RPBE1PBE
basis: 6-31G(d)
operation: Freq
keyword: #N
keyword: Geom=AllCheck
keyword: Guess=TCheck
keyword: SCRF=Check
keyword: GenChk
keyword: RPBE1PBE/6-31G(d)
keyword: Freq
converged: YES YES YES YES
title: Mulliken charges:
elementType: C C C H H H C H C H C H C H C H C H
charge: -0.234468 -0.234468 -0.280429 0.274089 0.274089 0.277717 0.087222 0.277084 -0.343543 0.269921 -0.209535 0.269190 -0.005629 0.262368 -0.209535 0.269190 -0.005629 0.262368
chargesum: 1.00000
title: Mulliken charges with hydrogens summed into heavy atoms:
elementType: C C C C C C C C C
charge: 0.039621 0.039621 -0.002713 0.364306 -0.073622 0.059655 0.256739 0.059655 0.256739
1716.lowfreq: -267.2972 -0.0010 -0.0008 -0.0007 3.0697 5.8189 10.3782 284.4960 408.5374
frequency: -267.2972 284.4959 408.5373 467.7257 476.5898 498.6092 523.5119 601.4022 628.3017 675.9331 737.0545 750.5909 798.3161 854.7272 895.5752 914.2147 926.4122 933.2863 946.3638 972.5964 1003.2074 1019.9216 1074.5738 1085.2910 1102.2444 1149.6936 1163.3415 1172.8105 1186.6208 1196.1308 1290.2691 1326.9501 1341.1296 1427.0076 1446.7773 1461.5962 1542.6861 1620.1662 1637.6223 3216.4894 3235.6762 3241.3435 3251.2789 3253.3029 3254.5571 3272.4887 3272.7662 3275.0453
redmass: 6.1893 4.1003 4.7662 2.3048 2.4960 5.1009 6.1393 5.1213 2.3541 4.5826 2.4423 1.5819 1.6256 2.1781 2.3287 1.8933 2.0049 2.8502 1.5226 1.6567 1.2878 1.8543 1.7857 1.4803 1.2967 1.2453 1.1518 1.1156 1.1706 1.2467 2.0886 1.2420 1.2687 2.5331 1.8606 1.9301 3.0943 5.3240 6.0681 1.0911 1.0906 1.0909 1.0904 1.0921 1.0908 1.0975 1.0992 1.0983
irintensity: 25.0868 1.7920 2.6201 1.7751 1.3383 0.0462 4.1612 3.5954 2.3951 1.7351 26.1184 42.8305 18.3501 5.6602 8.2386 6.1906 28.5550 4.0271 4.9198 10.4370 0.0249 17.2694 8.4059 0.0475 0.0088 11.3491 1.9269 1.1637 2.6319 2.2133 38.5182 1.0372 1.9020 7.3329 29.8050 5.5234 15.4199 5.9075 0.0376 0.4736 0.0521 3.2787 20.9397 20.7700 9.3236 16.9073 6.1210 5.4600
temp: 298.150 k
press: 1.00000 atm
elementType: 6 6 6 1 1 1 6 1 6 1 6 1 6 1 6 1 6 1
symmnumber: 1
zpe: 399643.8 jmol-1
zpe.correction: 0.152216 hartree
zpe.thermalcorrener: 0.158067 hartree
zpe.thermalcorrenthalpy: 0.159011 hartree
zpe.thermalcorrgfe: 0.122623 hartree
zpe.sumelectzpe: -347.460890 hartree
zpe.sumelectthermal: -347.455040 hartree
zpe.sumelectthermalent: -347.454095 hartree
zpe.sumelectthermalfe: -347.490483 hartree
dipole: -0.5722 0.0386 -0.0000
dipole: 0.5735
quadrupole: -40.4127 -34.3857 -42.9105
quadrupole: 2.3107 -0.0000 -0.0000
quadrupole: -1.1764 4.8506 -3.6742 2.3107 -0.0000 -0.0000
hfenergy: -347.6131062 hartree
pointgroup: CS [SG(C3H3),X(C6H6)]
dipole: -0.2253935 0.0101409 0. debye
dipolederiv: 0.2447298 -0.1800121 0.0117311 -0.1098805 0.1020504 -0.0660227 -0.0662584 0.0146811 0.0865765 0.2447298 -0.1800121 -0.0117311 -0.1098805 0.1020504 0.0660227 0.0662584 -0.0146811 0.0865765 -0.0564935 0.2724247 0. 0.3172225 -0.3221783 0. 0. 0. -0.0413419 0.122369 0.0172003 -0.0347872 -0.0277519 0.0854879 0.0069799 -0.0321271 0.0257512 0.089435 0.122369 0.0172003 0.0347872 -0.0277519 0.0854879 -0.0069799 0.0321271 -0.0257512 0.089435 0.0634806 -0.0023198 0. 0.0217603 0.0952842 0. 0. 0. 0.1440748 -0.0345607 0.0746096 0. 0.1429266 0.2964208 0. 0. 0. -0.07783 0.1344779 -0.0050054 0. -0.0059439 0.1159341 0. 0. 0. 0.1204024 -0.5084194 -0.1792652 0. -0.1140391 0.1172605 0. 0. 0. 0.0690039 0.077212 0.0238027 0. 0.0033875 0.0552217 0. 0. 0. 0.1259543 0.2361212 0.0341903 0.1555003 0.0411229 -0.0441524 0.0583195 -0.1538945 -0.0436267 0.1711468 0.1341584 -0.0167339 -0.0187648 -0.0032836 0.1082429 0.0303607 -0.0666758 -0.0000998 0.0713346 -0.1290129 0.0795186 0.0223233 -0.0874246 -0.0499871 0.0196833 -0.0828861 0.0347042 -0.2457845 0.0537861 -0.0262865 -0.0364517 0.0045608 0.1193867 0.0116494 0.0517555 0.0155251 0.1571598 0.2361212 0.0341903 -0.1555003 0.0411229 -0.0441524 -0.0583195 0.1538945 0.0436267 0.1711468 0.1341584 -0.0167339 0.0187648 -0.0032836 0.1082429 -0.0303607 0.0666758 0.0000998 0.0713346 -0.1290129 0.0795186 -0.0223233 -0.0874246 -0.0499871 -0.0196833 0.0828861 -0.0347042 -0.2457845 0.0537861 -0.0262865 0.0364517 0.0045608 0.1193867 -0.0116494 -0.0517555 -0.0155251 0.1571598 unknown
polarizability: 75.0103272|3.3975663|87.1593436|0.|0.|73.8322358 unknown
InChI: InChI=1/9C.9H
charge 1 multiplicity 1
18 atoms
C  0.05588599 -1.29666913 0.7515124
C  0.05588599 -1.29666913 -0.7515124
C  -1.30059759 -0.80821285 0.0000
H  -0.07396769 -2.27068728 1.2141546
H  -0.07396769 -2.27068728 -1.2141546
H  -2.11815351 -1.51992932 0.0000
C  -1.50731778 0.55014702 0.0000
H  -2.51043717 0.96602422 0.0000
C  -0.35873407 1.42170446 0.0000
H  -0.56068514 2.49029833 0.0000
C  0.74044502 1.00418392 0.98767511
H  1.3745243 1.79961691 1.36366668
C  0.76916495 -0.27289508 1.44881043
H  1.36213505 -0.53999527 2.31796336
C  0.74044502 1.00418392 -0.98767511
H  1.3745243 1.79961691 -1.36366668
C  0.76916495 -0.27289508 -1.44881043
H  1.36213505 -0.53999527 -2.31796336
