program: Gaussian 16
title: Title Card Required
version: ES64L-G16RevA.03
frameworkgroup: C3H[SGH(C3H3),X(C6H6)]
method: RPBE1PBE
basis: 6-31G(d)
operation: Freq
keyword: #N
keyword: Geom=AllCheck
keyword: Guess=TCheck
keyword: SCRF=Check
keyword: GenChk
keyword: RPBE1PBE/6-31G(d)
keyword: Freq
converged: YES YES YES YES
title: Mulliken charges:
elementType: C H C C H H C H C C H H C H C C H H
charge: 0.054975 0.268140 -0.270540 -0.270540 0.275649 0.275649 0.054975 0.268140 -0.270540 -0.270540 0.275649 0.275649 0.054975 0.268140 -0.270540 -0.270540 0.275649 0.275649
chargesum: 1.00000
title: Mulliken charges with hydrogens summed into heavy atoms:
elementType: C C C C C C C C C
charge: 0.323115 0.005109 0.005109 0.323115 0.005109 0.005109 0.323115 0.005109 0.005109
1716.lowfreq: -0.0028 -0.0027 -0.0024 4.6207 4.6207 9.6442 380.5334 408.1208 408.1208
frequency: 380.5334 408.1206 408.1206 496.3607 496.3607 553.0924 553.0924 584.3229 584.3229 600.9001 665.5865 790.7819 790.7819 837.6852 895.4967 909.2110 949.2721 949.2721 951.5744 951.5744 1012.0640 1012.0640 1082.1219 1084.5708 1111.8207 1111.8207 1155.3014 1155.3014 1176.6634 1188.6060 1210.7461 1334.4929 1334.4929 1440.1260 1471.5845 1471.5845 1487.3976 1589.9438 1589.9438 3248.4294 3248.4294 3254.9847 3254.9993 3254.9993 3262.2913 3265.0022 3265.0022 3269.9495
redmass: 3.4703 8.4885 8.4885 2.0309 2.0309 6.7859 6.7859 6.4454 6.4454 1.9317 6.3157 1.7120 1.7120 1.7293 2.8526 5.5348 1.0780 1.0780 2.8884 2.8884 1.5025 1.5025 1.2700 1.2389 1.5206 1.5206 1.0853 1.0853 1.4474 1.4725 1.4248 1.2231 1.2231 2.6255 2.0233 2.0233 2.4131 5.2321 5.2321 1.0894 1.0894 1.0886 1.0937 1.0937 1.0926 1.0979 1.0979 1.1000
irintensity: 0.0000 0.0000 0.0000 0.0087 0.0086 0.0000 0.0000 7.4641 7.4638 0.0000 0.0000 38.2301 38.2312 0.0000 0.6046 0.0000 0.0000 0.0000 9.1169 9.1169 20.8971 20.8972 0.0000 0.0000 10.0317 10.0317 0.0000 0.0000 39.6524 0.0000 40.0208 0.0000 0.0000 0.0000 24.6121 24.6123 7.4260 0.0000 0.0000 4.3271 4.3270 0.0000 0.0000 0.0000 28.6771 30.9495 30.9502 0.0000
temp: 298.150 k
press: 1.00000 atm
elementType: 6 1 6 6 1 1 6 1 6 6 1 1 6 1 6 6 1 1
symmnumber: 3
zpe: 401354.3 jmol-1
zpe.correction: 0.152868 hartree
zpe.thermalcorrener: 0.158913 hartree
zpe.thermalcorrenthalpy: 0.159857 hartree
zpe.thermalcorrgfe: 0.124322 hartree
zpe.sumelectzpe: -347.465300 hartree
zpe.sumelectthermal: -347.459255 hartree
zpe.sumelectthermalent: -347.458311 hartree
zpe.sumelectthermalfe: -347.493846 hartree
dipole: -0.0000 0.0000 0.0000
dipole: 0.0000
quadrupole: -41.9742 -41.9742 -33.6996
quadrupole: -0.0000 -0.0000 -0.0000
quadrupole: -2.7582 -2.7582 5.5164 -0.0000 -0.0000 -0.0000
hfenergy: -347.618168 hartree
pointgroup: C03H [SGH(C3H3),X(C6H6)]
dipole: 0. 0. 0. debye
dipolederiv: -0.0765232 -0.0000098 0. -0.0000043 -0.2343899 0. 0. 0. 0.2033259 0.0678846 0.0000074 0. -0.0000006 0.1405253 0. 0. 0. 0.1145549 0.2570228 -0.0000073 0.0000028 -0.0000068 -0.0899007 0.1906461 -0.0000075 0.2239797 -0.0873392 0.2570228 -0.0000073 -0.0000028 -0.0000068 -0.0899007 -0.1906461 0.0000075 -0.2239797 -0.0873392 0.1539619 0.0000031 0.0000002 -0.0000008 0.0634995 0.0214221 -0.0000004 -0.0121926 0.095066 0.1539619 0.0000031 -0.0000002 -0.0000008 0.0634995 -0.0214221 0.0000004 0.0121926 0.095066 -0.19492 0.0683566 0. 0.0683637 -0.1159932 0. 0. 0. 0.2033259 0.1223648 -0.0314535 0. -0.0314555 0.086045 0. 0. 0. 0.1145549 -0.0031654 0.1502249 0.1651044 0.1502247 0.1702875 -0.095323 0.1939736 -0.1119872 -0.0873392 -0.0031654 0.1502249 -0.1651044 0.1502247 0.1702875 0.095323 -0.1939736 0.1119872 -0.0873392 0.0861151 0.0391726 0.0185532 0.0391702 0.1313463 -0.0107091 -0.0105592 0.0060963 0.095066 0.0861151 0.0391726 -0.0185532 0.0391702 0.1313463 0.0107091 0.0105592 -0.0060963 0.095066 -0.1949249 -0.0683564 0. -0.06835 -0.115985 0. 0. 0. 0.2033228 0.1223673 0.0314558 0. 0.0314508 0.0860439 0. 0. 0. 0.1145548 -0.0031756 -0.1502195 -0.1651036 -0.1502194 0.1702969 -0.0953211 -0.1939679 -0.1119935 -0.0873396 -0.0031756 -0.1502195 0.1651036 -0.1502194 0.1702969 0.0953211 0.1939679 0.1119935 -0.0873396 0.0861158 -0.0391703 -0.0185514 -0.0391735 0.1313463 -0.0107118 0.0105608 0.0060971 0.0950672 0.0861158 -0.0391703 0.0185514 -0.0391735 0.1313463 0.0107118 -0.0105608 -0.0060971 0.0950672 unknown
polarizability: 75.0530988|-0.0000235|75.053126|0.|0.|85.8687055 unknown
InChI: InChI=1/9C.9H
charge 1 multiplicity 1
18 atoms
C  0.00000503 1.63187418 0.0000
H  -0.00000494 2.71702812 0.0000
C  0.00000769 0.91758603 1.20143492
C  0.00000769 0.91758603 -1.20143492
H  -0.00000306 1.42659499 -2.15943047
H  -0.00000306 1.42659499 2.15943047
C  1.41324173 -0.81594102 0.0000
H  2.3530176 -1.35850935 0.0000
C  0.79464872 -0.45879925 1.20143492
C  0.79464872 -0.45879925 -1.20143492
H  1.23546878 -0.71329442 -2.15943047
H  1.23546878 -0.71329442 2.15943047
C  -1.41324676 -0.8159323 0.0000
H  -2.35301266 -1.35851791 0.0000
C  -0.79465641 -0.45878592 1.20143492
C  -0.79465641 -0.45878592 -1.20143492
H  -1.23546572 -0.71329971 -2.15943047
H  -1.23546572 -0.71329971 2.15943047
