program: Gaussian 16
title: Title Card Required
version: ES64L-G16RevA.03
frameworkgroup: C2V[C2(CH),SGV(C4H4),X(C4H4)]
method: RMN12SX
basis: 6-31G(d)
operation: Freq
keyword: #N
keyword: Geom=AllCheck
keyword: Guess=TCheck
keyword: SCRF=Check
keyword: GenChk
keyword: RMN12SX/6-31G(d)
keyword: Freq
converged: YES YES YES YES
title: Mulliken charges:
elementType: C C C C H H C H C H H H C H C H C H
charge: -0.124697 -0.397844 -0.397844 -0.124697 0.271371 0.271371 -0.001870 0.287876 -0.001870 0.287876 0.265941 0.265941 -0.124697 0.271371 -0.124697 0.271371 -0.169249 0.274349
chargesum: 1.00000
title: Mulliken charges with hydrogens summed into heavy atoms:
elementType: C C C C C C C C C
charge: 0.146674 -0.131903 -0.131903 0.146674 0.286006 0.286006 0.146674 0.146674 0.105100
1716.lowfreq: -248.7574 -15.8080 -7.8242 -0.0008 -0.0005 -0.0004 7.7610 299.5941 361.7882
frequency: -248.7572 299.5940 361.7881 374.3514 387.5005 419.7309 440.8925 507.4780 594.3940 692.5966 732.0784 785.2552 818.3970 832.1718 904.6273 914.7934 920.3565 922.4871 941.3398 946.2083 966.1386 1034.9496 1054.5298 1072.8868 1145.3132 1164.6082 1209.3375 1250.0786 1271.1246 1276.8747 1288.3388 1312.0221 1355.9946 1356.6197 1440.9150 1559.4892 1570.8051 1722.8596 1756.7879 3164.3665 3164.9470 3182.4430 3185.3599 3234.5649 3236.3139 3237.4735 3258.5390 3260.9459
redmass: 2.1886 3.6066 3.9284 2.9342 1.7186 3.1839 2.9857 5.9851 6.3482 1.2414 1.5585 2.1278 4.8900 2.5809 3.6007 2.0515 2.3351 1.5806 2.7469 2.2761 2.8631 2.5018 1.5537 1.5861 1.0141 1.1769 1.2954 1.1520 1.3692 1.3311 1.3488 1.2393 1.4638 1.3241 1.4968 2.6901 3.9875 6.1466 6.9977 1.0881 1.0885 1.0912 1.0930 1.0950 1.0853 1.0866 1.1071 1.1086
irintensity: 0.0000 0.0469 0.2552 0.4358 44.3663 0.0000 0.3218 3.2096 0.0000 5.3620 103.8128 60.7553 5.4820 0.3898 8.6716 4.4592 5.3155 0.0000 6.0888 0.0000 6.6462 0.0337 0.1508 0.0000 0.2517 14.8188 8.3299 41.8752 40.5081 0.0000 14.1160 0.0000 37.7345 0.3915 13.0687 6.7496 123.8392 9.1334 20.6385 0.8087 0.0205 0.2708 6.1522 7.8163 0.0000 27.5455 30.3667 17.1657
temp: 298.150 k
press: 1.00000 atm
elementType: 6 6 6 6 1 1 6 1 6 1 1 1 6 1 6 1 6 1
symmnumber: 2
zpe: 397941.8 jmol-1
zpe.correction: 0.151568 hartree
zpe.thermalcorrener: 0.157792 hartree
zpe.thermalcorrenthalpy: 0.158736 hartree
zpe.thermalcorrgfe: 0.122266 hartree
zpe.sumelectzpe: -347.573257 hartree
zpe.sumelectthermal: -347.567033 hartree
zpe.sumelectthermalent: -347.566089 hartree
zpe.sumelectthermalfe: -347.602559 hartree
dipole: 0.0000 0.0000 1.9187
dipole: 1.9187
quadrupole: -44.7813 -33.4959 -40.4112
quadrupole: -0.0000 -0.0000 -0.0000
quadrupole: -5.2185 6.0669 -0.8484 -0.0000 -0.0000 -0.0000
hfenergy: -347.7248249 hartree
pointgroup: C02V [C2(C1H1),SGV(C4H4),X(C4H4)]
dipole: 0. 0. 0.7548623 debye
dipolederiv: 0.1229084 -0.0180457 -0.1567512 -0.2662733 -0.1158322 0.3171541 -0.1255184 0.0187068 -0.0906381 -0.208112 0. 0. 0. 0.2437261 -0.2601623 0. 0.0268381 -0.3338115 -0.208112 0. 0. 0. 0.2437261 0.2601624 0. -0.0268381 -0.3338115 0.1229084 0.0180457 -0.1567512 0.2662733 -0.1158322 -0.3171541 -0.1255184 -0.0187068 -0.0906381 0.0953387 0.0070086 0.0409126 0.0480557 0.1225117 -0.0589871 0.0266911 -0.0101791 0.1500598 0.0953387 -0.0070086 0.0409126 -0.0480557 0.1225117 0.0589871 0.0266911 0.0101791 0.1500598 0.0681963 0. 0. 0. 0.5926724 -0.0154887 0. -0.3138658 0.5406192 0.1640732 0. 0. 0. 0.1228909 0.0117248 0. -0.0061318 0.0648817 0.0681963 0. 0. 0. 0.5926724 0.0154887 0. 0.3138658 0.5406192 0.1640732 0. 0. 0. 0.1228909 -0.0117248 0. 0.0061318 0.0648816 0.0580505 0. 0. 0. 0.0230234 -0.0031559 0. -0.0012135 0.0607888 0.0580505 0. 0. 0. 0.0230234 0.0031559 0. 0.0012135 0.0607888 0.1229084 -0.0180457 0.1567512 -0.2662733 -0.1158322 -0.3171541 0.1255184 -0.0187068 -0.0906381 0.0953387 0.0070086 -0.0409126 0.0480557 0.1225117 0.0589871 -0.0266911 0.0101791 0.1500598 0.1229084 0.0180457 0.1567512 0.2662733 -0.1158322 0.3171542 0.1255184 0.0187068 -0.0906381 0.0953387 -0.0070086 -0.0409126 -0.0480557 0.1225117 -0.0589871 -0.0266911 -0.0101791 0.1500598 -0.2081147 0. 0. 0. -1.0703285 0. 0. 0. 0.009259 0.1707101 0. 0. 0. 0.0789847 0. 0. 0. 0.0880978 unknown
polarizability: 64.0880856|0.|98.6838569|0.|0.|76.8943765 unknown
InChI: InChI=1/9C.9H
charge 1 multiplicity 1
18 atoms
C  1.23991154 0.65805146 -0.88888763
C  0.0000 1.37407566 -0.31282085
C  0.0000 -1.37407566 -0.31282085
C  1.23991154 -0.65805146 -0.88888763
H  2.03990118 1.28453595 -1.28044176
H  2.03990118 -1.28453595 -1.28044176
C  0.0000 1.21552756 1.15776216
H  0.0000 2.12542949 1.76902589
C  0.0000 -1.21552756 1.15776216
H  0.0000 -2.12542949 1.76902589
H  0.0000 -2.43581859 -0.57941828
H  0.0000 2.43581859 -0.57941828
C  -1.23991154 -0.65805146 -0.88888763
H  -2.03990118 -1.28453595 -1.28044176
C  -1.23991154 0.65805146 -0.88888763
H  -2.03990118 1.28453595 -1.28044176
C  0.0000 0.0000 1.82847595
H  0.0000 0.0000 2.91828376
