program: Gaussian 16
title: Title Card Required
version: ES64L-G16RevA.03
frameworkgroup: CS[SG(C3H3),X(C6H6)]
method: RMN12SX
basis: 6-31G(d)
operation: Freq
keyword: #N
keyword: Geom=AllCheck
keyword: Guess=TCheck
keyword: SCRF=Check
keyword: GenChk
keyword: RMN12SX/6-31G(d)
keyword: Freq
converged: YES YES YES YES
title: Mulliken charges:
elementType: C C C H H H C H C H C H C H C H C H
charge: -0.254028 -0.254028 -0.298287 0.285488 0.285488 0.288790 0.068193 0.294082 -0.344332 0.284213 -0.236928 0.285211 -0.009227 0.283155 -0.236928 0.285211 -0.009227 0.283155
chargesum: 1.00000
title: Mulliken charges with hydrogens summed into heavy atoms:
elementType: C C C C C C C C C
charge: 0.031460 0.031460 -0.009497 0.362275 -0.060119 0.048283 0.273928 0.048283 0.273928
1716.lowfreq: -291.8680 -17.2146 -11.8275 -5.6424 0.0007 0.0009 0.0011 269.0188 402.0018
frequency: -291.8677 269.0175 402.0018 475.7271 482.7919 492.8909 516.7332 598.7048 628.0626 667.3884 719.0141 748.9061 801.6983 841.0775 897.8069 915.1266 925.1095 929.9312 942.4086 969.2773 994.2366 1013.5880 1078.0963 1083.5251 1095.6369 1127.6793 1159.6197 1165.4018 1184.8582 1192.8592 1265.5115 1321.0540 1333.6132 1428.5737 1446.8418 1461.2048 1525.4835 1604.5106 1619.0623 3208.3679 3223.5842 3228.8470 3237.0816 3239.1532 3241.8111 3255.4730 3256.5438 3258.7964
redmass: 6.8325 4.5284 4.5295 2.4010 2.4384 5.0468 6.6221 5.2156 2.2435 5.0837 2.6681 1.5904 1.6427 2.1089 2.0167 1.8460 1.9523 2.8612 1.5980 1.6800 1.2625 1.8988 1.7394 1.3593 1.3947 1.2655 1.1325 1.0951 1.1026 1.3801 2.1482 1.2375 1.2586 2.5571 1.8950 1.9553 2.8562 5.2491 5.9082 1.0916 1.0908 1.0914 1.0916 1.0905 1.0916 1.0983 1.1007 1.1000
irintensity: 18.1560 0.6442 0.7110 0.9186 0.5087 1.3165 3.0456 3.2057 1.6088 1.3184 19.4156 38.2668 21.9612 6.5648 8.3203 6.7986 23.1369 2.5415 3.3361 12.6973 1.8142 19.1418 11.1661 0.0867 0.0021 12.5661 1.0171 0.0310 3.4466 3.1159 39.1581 0.6617 1.0153 4.9122 28.8701 8.5655 16.2159 3.4924 0.1243 2.3759 0.0681 7.0360 33.6364 32.0562 24.6742 35.2194 19.1497 10.6800
temp: 298.150 k
press: 1.00000 atm
elementType: 6 6 6 1 1 1 6 1 6 1 6 1 6 1 6 1 6 1
symmnumber: 1
zpe: 397606.9 jmol-1
zpe.correction: 0.151440 hartree
zpe.thermalcorrener: 0.157340 hartree
zpe.thermalcorrenthalpy: 0.158284 hartree
zpe.thermalcorrgfe: 0.121818 hartree
zpe.sumelectzpe: -347.580492 hartree
zpe.sumelectthermal: -347.574593 hartree
zpe.sumelectthermalent: -347.573649 hartree
zpe.sumelectthermalfe: -347.610115 hartree
dipole: -0.3870 0.0804 -0.0000
dipole: 0.3952
quadrupole: -41.0878 -34.9642 -43.4122
quadrupole: 2.4251 -0.0000 0.0000
quadrupole: -1.2664 4.8572 -3.5908 2.4251 -0.0000 0.0000
hfenergy: -347.7319329 hartree
pointgroup: CS [SG(C3H3),X(C6H6)]
dipole: -0.1525775 0.0299603 0. debye
dipolederiv: 0.1957095 -0.1866339 -0.0526135 -0.1334611 0.0653195 -0.0771222 -0.082166 -0.0093568 0.0593847 0.1957095 -0.1866339 0.0526135 -0.1334611 0.0653195 0.0771222 0.082166 0.0093568 0.0593847 -0.019747 0.2422158 0. 0.2780006 -0.3244851 0. 0. 0. 0.0226331 0.1237284 0.013221 -0.0388161 -0.0244151 0.1118551 -0.006456 -0.0356967 0.0121254 0.0911669 0.1237284 0.013221 0.0388161 -0.0244151 0.1118551 0.006456 0.0356967 -0.0121254 0.0911669 0.0786702 0.0163484 0. 0.0380013 0.1054681 0. 0. 0. 0.1438105 -0.0899087 0.0884869 0. 0.1784613 0.2495573 0. 0. 0. -0.0953185 0.1776472 -0.0240305 0. -0.0251295 0.1188824 0. 0. 0. 0.1168877 -0.4826368 -0.1375055 0. -0.1403625 0.0821375 0. 0. 0. 0.0988587 0.0729045 0.0166245 0. -0.0027389 0.0893274 0. 0. 0. 0.1322891 0.229811 0.0005027 0.1254305 0.0350618 -0.0790565 0.0864324 -0.1572751 0.0156967 0.1488796 0.1435762 0.0019562 -0.014362 0.009994 0.1263579 0.0427195 -0.0553569 0.0146285 0.0779044 -0.1332688 0.0982255 0.0040424 -0.0494807 -0.0036526 0.0299655 -0.0915843 0.0345574 -0.2695543 0.071979 -0.0283412 -0.0083492 -0.0008151 0.1187329 0.0020293 0.0650699 0.0017385 0.1826384 0.229811 0.0005027 -0.1254305 0.0350618 -0.0790565 -0.0864324 0.1572751 -0.0156967 0.1488796 0.1435762 0.0019562 0.014362 0.009994 0.1263579 -0.0427195 0.0553569 -0.0146285 0.0779044 -0.1332688 0.0982255 -0.0040424 -0.0494807 -0.0036526 -0.0299655 0.0915843 -0.0345574 -0.2695543 0.071979 -0.0283412 0.0083492 -0.0008151 0.1187329 -0.0020293 -0.0650699 -0.0017385 0.1826384 unknown
polarizability: 77.9129365|3.6130217|89.8078159|0.|0.|76.1514163 unknown
InChI: InChI=1/9C.9H
charge 1 multiplicity 1
18 atoms
C  0.05297931 -1.29609321 0.75559552
C  0.05297931 -1.29609321 -0.75559552
C  -1.29941971 -0.80740335 0.0000
H  -0.07377283 -2.2755827 1.21661561
H  -0.07377283 -2.2755827 -1.21661561
H  -2.11427344 -1.52864638 0.0000
C  -1.5154156 0.55073751 0.0000
H  -2.52487596 0.96251777 0.0000
C  -0.37669826 1.42395429 0.0000
H  -0.56780986 2.49818798 0.0000
C  0.75586108 0.9980001 0.9490598
H  1.39232328 1.79960862 1.32027308
C  0.76966772 -0.27458649 1.43824369
H  1.35241284 -0.52745024 2.32308874
C  0.75586108 0.9980001 -0.9490598
H  1.39232328 1.79960862 -1.32027308
C  0.76966772 -0.27458649 -1.43824369
H  1.35241284 -0.52745024 -2.32308874
