program: Gaussian 16
title: Title Card Required
version: ES64L-G16RevA.03
frameworkgroup: C2[C2(CH),X(C8H8)]
method: RMN12SX
basis: 6-31G(d)
operation: Freq
keyword: #N
keyword: Geom=AllCheck
keyword: Guess=TCheck
keyword: SCRF=Check
keyword: GenChk
keyword: RMN12SX/6-31G(d)
keyword: Freq
converged: YES YES NO YES
title: Mulliken charges:
elementType: C H C C H H C H C C H H C H C C H H
charge: -0.117115 0.284625 -0.107309 -0.107309 0.284086 0.284086 -0.025890 0.279022 -0.363473 -0.205214 0.278624 0.276400 -0.025890 0.279022 -0.205214 -0.363473 0.276400 0.278624
chargesum: 1.00000
title: Mulliken charges with hydrogens summed into heavy atoms:
elementType: C C C C C C C C C
charge: 0.167510 0.176777 0.176777 0.253132 -0.087073 0.073409 0.253132 0.073409 -0.087073
1716.lowfreq: -186.1491 -11.8222 -11.3374 -0.0008 0.0002 0.0004 17.4468 180.3062 341.8198
frequency: -186.1474 180.3055 341.8188 377.3949 425.0854 470.4770 512.6834 621.8213 625.2507 717.0365 733.7527 752.6294 833.6788 858.1494 879.8689 889.9025 917.1510 938.1189 957.7641 966.3956 982.6625 994.1942 1065.9751 1068.6851 1153.0551 1176.2780 1190.4906 1190.6902 1202.6822 1213.3800 1320.6552 1329.8143 1366.8243 1408.9889 1412.8230 1499.7059 1555.1132 1657.9209 1686.3928 3182.9406 3183.3481 3208.4133 3218.9228 3226.8424 3235.0037 3235.4285 3259.2360 3260.7625
redmass: 4.4690 3.7028 3.3343 4.6234 2.6957 2.6797 6.1534 5.6581 2.2275 1.2758 1.8186 1.4776 3.4604 3.3374 2.4263 2.3428 3.0025 2.3737 1.4343 1.3853 1.9454 1.5463 1.9456 1.7715 1.1031 1.1869 1.3327 1.1539 1.1366 1.2979 1.3028 1.2702 2.0040 1.9217 1.6330 2.4840 4.0496 5.6381 6.3048 1.0898 1.0899 1.0864 1.0939 1.0985 1.0893 1.0887 1.1020 1.1033
irintensity: 71.2807 18.5482 0.4869 2.4989 10.8509 12.9654 0.4893 5.0218 2.1727 49.6479 72.9927 1.4984 8.1017 15.0868 5.1183 0.3932 27.0779 6.9483 7.0185 8.6088 0.0230 0.2577 2.9350 2.7040 1.7966 8.5802 1.6842 9.0602 7.9774 5.8175 1.2461 4.1750 12.6053 1.2184 23.9332 0.0000 67.6584 6.4901 7.3770 1.0165 0.0826 5.3933 13.4470 32.5993 29.8224 2.5974 26.7074 2.9049
temp: 298.150 k
press: 1.00000 atm
elementType: 6 1 6 6 1 1 6 1 6 6 1 1 6 1 6 6 1 1
symmnumber: 2
zpe: 397677.7 jmol-1
zpe.correction: 0.151467 hartree
zpe.thermalcorrener: 0.157662 hartree
zpe.thermalcorrenthalpy: 0.158606 hartree
zpe.thermalcorrgfe: 0.122085 hartree
zpe.sumelectzpe: -347.580131 hartree
zpe.sumelectthermal: -347.573936 hartree
zpe.sumelectthermalent: -347.572992 hartree
zpe.sumelectthermalfe: -347.609513 hartree
dipole: 0.0000 0.0000 0.6666
dipole: 0.6666
quadrupole: -41.8116 -35.3399 -42.1722
quadrupole: 3.3969 0.0000 0.0000
quadrupole: -2.0370 4.4347 -2.3977 3.3969 0.0000 0.0000
hfenergy: -347.7315981 hartree
pointgroup: C02 [C2(C1H1),X(C8H8)]
dipole: 0. 0. 0.2622743 debye
dipolederiv: -0.3447138 -0.0731001 0. -0.494764 -0.5116028 0. 0. 0. -0.2223526 0.0641377 -0.1245663 0. 0.0021933 0.1491256 0. 0. 0. 0.171085 0.3251429 0.1383702 -0.1385471 0.1016892 0.2283359 0.0315538 -0.4241082 -0.1339722 0.4606707 0.3251429 0.1383702 0.1385471 0.1016892 0.2283359 -0.0315538 0.4241082 0.1339722 0.4606707 0.1540094 0.0263399 -0.0143557 -0.0181417 0.1150398 -0.0242981 0.015701 0.0119098 0.0822037 0.1540094 0.0263399 0.0143557 -0.0181417 0.1150398 0.0242981 -0.015701 -0.0119098 0.0822037 -0.0487637 0.062535 -0.0216603 0.0271859 -0.0188244 -0.1297621 -0.0209687 -0.0165489 -0.1924897 0.0865634 -0.0173556 -0.0246202 -0.017427 0.1166368 0.0002498 0.0660441 -0.0020316 0.2036845 -0.2526233 -0.1027487 0.204359 0.0465171 0.1816406 -0.1008637 -0.0929673 0.0284747 0.0107038 0.1954452 -0.0250423 0.1823096 0.0724062 -0.1096062 0.0760377 -0.1382046 -0.0484744 -0.2370577 0.1051155 0.0100968 -0.021675 0.0446685 0.1096816 0.0488421 -0.0636384 0.0298674 0.0990417 0.0753986 0.0066378 -0.0107928 -0.0106129 0.0583345 0.0088217 -0.0208489 0.0090959 0.0988767 -0.0487637 0.062535 0.0216603 0.0271859 -0.0188243 0.1297621 0.0209687 0.0165489 -0.1924897 0.0865634 -0.0173556 0.0246202 -0.017427 0.1166368 -0.0002498 -0.0660441 0.0020316 0.2036845 0.1954452 -0.0250423 -0.1823096 0.0724062 -0.1096062 -0.0760377 0.1382046 0.0484744 -0.2370577 -0.2526233 -0.1027487 -0.204359 0.0465171 0.1816406 0.1008637 0.0929673 -0.0284747 0.0107038 0.0753986 0.0066378 0.0107928 -0.0106129 0.0583345 -0.0088217 0.0208489 -0.0090959 0.0988767 0.1051155 0.0100968 0.021675 0.0446685 0.1096816 -0.0488421 0.0636384 -0.0298674 0.0990417 unknown
polarizability: 75.0249031|7.4334079|92.8158706|0.|0.|78.5017582 unknown
InChI: InChI=1/9C.9H
charge 1 multiplicity 1
18 atoms
C  0.0000 0.0000 1.73967004
H  0.0000 0.0000 2.83091559
C  0.38636628 1.14486461 1.06747753
C  -0.38636628 -1.14486461 1.06747753
H  -0.95152271 -1.93163669 1.57327467
H  0.95152271 1.93163669 1.57327467
C  -1.22076834 0.69770855 -0.83842752
H  -2.03097222 1.29244366 -1.25963797
C  -0.00580965 1.39361096 -0.34732022
C  -1.28204233 -0.63618411 -0.77395313
H  -2.15790862 -1.23459001 -1.01857668
H  0.04395169 2.45284892 -0.613649
C  1.22076834 -0.69770855 -0.83842752
H  2.03097222 -1.29244366 -1.25963797
C  1.28204233 0.63618411 -0.77395313
C  0.00580965 -1.39361096 -0.34732022
H  -0.04395169 -2.45284892 -0.613649
H  2.15790862 1.23459001 -1.01857668
