program: Gaussian 16
title: Title Card Required
version: ES64L-G16RevA.03
frameworkgroup: C2[C2(CH),X(C8H8)]
method: RBLYP
basis: 6-31G(d)
operation: Freq
keyword: #N
keyword: Geom=AllCheck
keyword: Guess=TCheck
keyword: SCRF=Check
keyword: GenChk
keyword: RBLYP/6-31G(d)
keyword: Freq
converged: YES YES YES YES
title: Mulliken charges:
elementType: C H C C H H C H C C H H C H C C H H
charge: -0.030608 0.203652 -0.050451 -0.050451 0.211268 0.211268 0.006588 0.200244 -0.231897 -0.121051 0.204341 0.194436 0.006588 0.200244 -0.121051 -0.231897 0.194436 0.204341
chargesum: 1.00000
title: Mulliken charges with hydrogens summed into heavy atoms:
elementType: C C C C C C C C C
charge: 0.173045 0.160817 0.160817 0.206832 -0.037461 0.083289 0.206832 0.083289 -0.037461
1716.lowfreq: -0.0006 -0.0005 -0.0003 4.3923 5.3245 12.1117 143.3334 210.2268 336.8411
frequency: 143.3312 210.2266 336.8410 368.4580 407.0879 456.9532 507.9964 592.6754 609.2762 697.5398 702.4440 712.4001 769.4311 804.5049 827.9445 847.7181 882.4826 908.3926 915.0181 923.4302 946.8347 948.3616 1006.0928 1012.0118 1123.7169 1134.8937 1151.8802 1166.5571 1178.8846 1186.8579 1282.3368 1298.0283 1310.4031 1342.4972 1368.8121 1452.5628 1502.5708 1583.1894 1605.9547 3079.1766 3079.6902 3109.1729 3129.5092 3131.8041 3138.3385 3138.5835 3166.8593 3168.2235
redmass: 4.1156 3.2657 3.3462 4.4233 2.6456 2.8259 6.0793 2.1990 5.7283 1.8686 1.8624 1.3415 2.3869 3.4248 2.5355 2.6573 2.9018 1.8202 1.4708 1.9385 1.9189 1.5385 2.2031 2.1637 1.0727 1.4167 1.2111 1.1952 1.0878 1.2617 1.3084 1.3028 1.9280 1.6089 1.4128 2.1101 3.6625 5.2152 6.0286 1.0883 1.0886 1.0860 1.0916 1.0955 1.0891 1.0885 1.0984 1.0997
irintensity: 49.7694 11.4674 1.0151 2.8070 16.0204 10.7753 1.2598 0.6696 5.4069 27.9437 64.1595 0.9539 16.6411 6.8135 5.5148 0.0007 15.6494 7.1201 13.0868 9.7131 0.4697 0.6613 2.1117 1.1724 1.2262 8.0192 0.0182 13.7196 0.7707 5.2753 1.1092 6.9666 2.5084 0.8271 22.8049 0.0242 50.5091 4.1137 3.6781 1.6672 0.2622 7.3477 1.0665 3.5934 8.6937 1.4266 5.9487 0.3611
temp: 298.150 k
press: 1.00000 atm
elementType: 6 1 6 6 1 1 6 1 6 6 1 1 6 1 6 6 1 1
symmnumber: 2
zpe: 385005.9 jmol-1
zpe.correction: 0.146641 hartree
zpe.thermalcorrener: 0.153684 hartree
zpe.thermalcorrenthalpy: 0.154628 hartree
zpe.thermalcorrgfe: 0.116547 hartree
zpe.sumelectzpe: -347.712241 hartree
zpe.sumelectthermal: -347.705198 hartree
zpe.sumelectthermalent: -347.704254 hartree
zpe.sumelectthermalfe: -347.742335 hartree
dipole: 0.0000 0.0000 0.7418
dipole: 0.7418
quadrupole: -41.9295 -35.3846 -41.1849
quadrupole: 2.9024 0.0000 0.0000
quadrupole: -2.4299 4.1151 -1.6853 2.9024 0.0000 0.0000
hfenergy: -347.858882 hartree
pointgroup: C02 [C2(C1H1),X(C8H8)]
dipole: 0. 0. 0.2918513 debye
dipolederiv: -0.2553978 -0.0741523 0. -0.42886 -0.4411748 0. 0. 0. -0.1035707 0.0589957 -0.1081257 0. 0.0020363 0.1316259 0. 0. 0. 0.0988914 0.273472 0.1471121 -0.1164838 0.1043359 0.2436583 0.0321253 -0.3501007 -0.1181587 0.4167232 0.273472 0.1471121 0.1164838 0.1043359 0.2436583 -0.0321253 0.3501007 0.1181587 0.4167232 0.1288796 0.0087018 0.0071206 -0.0330246 0.0715094 -0.0008835 0.0270753 0.0350931 0.0621582 0.1288796 0.0087018 -0.0071206 -0.0330246 0.0715094 0.0008835 -0.0270753 -0.0350931 0.0621582 -0.021977 0.049351 -0.00622 0.0171642 -0.0113469 -0.1129635 0.0089138 -0.0207166 -0.1516918 0.0448014 0.0065805 -0.0417713 0.0054903 0.0949652 0.0126411 0.057426 0.0108227 0.1834664 -0.1810902 -0.1082261 0.2189786 0.046871 0.2385184 -0.1219065 -0.1180407 0.0220072 0.0187273 0.2179998 -0.0006262 0.1908024 0.0600981 -0.0749723 0.0306719 -0.0921664 -0.0540712 -0.1777559 0.0730832 -0.0182789 -0.0290652 0.0240769 0.0916386 0.0421827 -0.08292 0.0203138 0.0715178 0.0630324 0.0065247 -0.0077446 -0.0115999 0.0008037 0.0212636 -0.0140366 0.0167423 0.0791944 -0.021977 0.049351 0.00622 0.0171642 -0.0113468 0.1129635 -0.0089138 0.0207166 -0.1516918 0.0448014 0.0065805 0.0417713 0.0054903 0.0949652 -0.0126411 -0.057426 -0.0108227 0.1834664 0.2179998 -0.0006262 -0.1908024 0.0600981 -0.0749723 -0.0306719 0.0921664 0.0540712 -0.1777559 -0.1810902 -0.1082261 -0.2189786 0.046871 0.2385184 0.1219065 0.1180406 -0.0220072 0.0187273 0.0630324 0.0065247 0.0077446 -0.0115999 0.0008037 -0.0212636 0.0140367 -0.0167423 0.0791943 0.0730832 -0.0182789 0.0290652 0.0240769 0.0916386 -0.0421827 0.08292 -0.0203139 0.0715178 unknown
polarizability: 74.9636254|7.1823098|93.2985691|0.|0.|80.5254204 unknown
InChI: InChI=1/9C.9H
charge 1 multiplicity 1
18 atoms
C  0.0000 0.0000 1.77673666
H  0.0000 0.0000 2.8717979
C  0.35809892 1.17093856 1.10450073
C  -0.35809892 -1.17093856 1.10450073
H  -0.8848591 -1.97337457 1.63049229
H  0.8848591 1.97337457 1.63049229
C  -1.2278757 0.71481752 -0.85995622
H  -2.02260789 1.32459174 -1.29691993
C  0.0067046 1.40726743 -0.34041575
C  -1.30088963 -0.63038287 -0.81015741
H  -2.17689475 -1.22676718 -1.06912637
H  0.06109471 2.46913407 -0.60820412
C  1.2278757 -0.71481752 -0.85995622
H  2.02260789 -1.32459174 -1.29691993
C  1.30088963 0.63038287 -0.81015741
C  -0.0067046 -1.40726743 -0.34041575
H  -0.06109471 -2.46913407 -0.60820412
H  2.17689475 1.22676718 -1.06912637
