program: Gaussian 16
title: Title Card Required
version: ES64L-G16RevA.03
frameworkgroup: CS[SG(C3H3),X(C6H6)]
method: RBLYP
basis: 6-31G(d)
operation: Freq
keyword: #N
keyword: Geom=AllCheck
keyword: Guess=TCheck
keyword: SCRF=Check
keyword: GenChk
keyword: RBLYP/6-31G(d)
keyword: Freq
converged: YES YES YES YES
title: Mulliken charges:
elementType: C C C H H H C H C H C H C H C H C H
charge: -0.170088 -0.170088 -0.193083 0.210855 0.210855 0.215036 0.088106 0.207376 -0.212255 0.205813 -0.163639 0.211929 0.055401 0.200047 -0.163639 0.211929 0.055401 0.200047
chargesum: 1.00000
title: Mulliken charges with hydrogens summed into heavy atoms:
elementType: C C C C C C C C C
charge: 0.040766 0.040766 0.021953 0.295482 -0.006443 0.048290 0.255448 0.048290 0.255448
1716.lowfreq: -309.6443 -16.5677 -15.9012 -13.5399 -0.0001 0.0003 0.0003 220.2518 377.2549
frequency: -309.6442 220.2517 377.2549 465.2910 468.6240 483.6731 503.7097 556.6410 597.7745 648.0835 656.2043 718.6065 765.5632 789.1772 851.8902 867.5944 886.5560 895.7837 906.7666 926.3300 948.6437 969.9304 1039.6595 1042.4337 1051.5682 1084.7180 1127.1645 1134.5434 1142.8676 1156.4083 1200.9148 1290.8970 1298.3490 1361.3394 1400.1171 1414.1407 1462.0803 1523.3729 1532.5171 3125.6428 3140.3003 3144.4491 3150.5130 3153.5346 3155.5424 3170.0964 3171.1438 3173.4010
redmass: 7.4971 5.7694 3.9463 2.2280 2.3732 5.2578 6.8863 5.9332 2.1601 6.0196 3.6326 1.5476 1.7184 1.8404 2.8005 3.0003 1.3117 2.1287 1.9518 1.4847 1.3353 1.8867 1.8483 1.3521 1.4200 1.2805 1.2256 1.0921 1.4777 1.1296 1.8697 1.2310 1.2476 2.1046 1.7965 1.8451 2.4924 4.9258 5.3974 1.0906 1.0894 1.0888 1.0913 1.0931 1.0900 1.0973 1.0957 1.0966
irintensity: 8.4825 0.0609 0.0069 0.8664 0.1208 0.9349 3.5047 1.9972 0.9974 0.4004 5.1458 23.1387 26.3849 3.2496 10.7637 3.1133 2.5402 12.8466 2.9619 3.5766 9.0372 17.1510 11.5739 0.0002 0.0657 10.2939 0.0325 0.0117 1.9728 6.8205 33.7952 0.4129 0.2504 1.7302 17.2933 6.1822 12.3697 1.1359 0.0553 0.2557 2.6805 4.0909 14.5800 5.8819 12.0770 3.3463 9.6571 2.2055
temp: 298.150 k
press: 1.00000 atm
elementType: 6 6 6 1 1 1 6 1 6 1 6 1 6 1 6 1 6 1
symmnumber: 1
zpe: 383714.6 jmol-1
zpe.correction: 0.146149 hartree
zpe.thermalcorrener: 0.152397 hartree
zpe.thermalcorrenthalpy: 0.153341 hartree
zpe.thermalcorrgfe: 0.116282 hartree
zpe.sumelectzpe: -347.751446 hartree
zpe.sumelectthermal: -347.745198 hartree
zpe.sumelectthermalent: -347.744254 hartree
zpe.sumelectthermalfe: -347.781314 hartree
dipole: -0.2273 0.0453 -0.0000
dipole: 0.2318
quadrupole: -41.0942 -35.1316 -42.6391
quadrupole: 2.3111 -0.0000 0.0000
quadrupole: -1.4726 4.4900 -3.0175 2.3111 -0.0000 0.0000
hfenergy: -347.8975952 hartree
pointgroup: CS [SG(C3H3),X(C6H6)]
dipole: -0.0894279 0.0179081 0. debye
dipolederiv: 0.1440663 -0.1550871 -0.0665502 -0.115103 0.0809316 -0.0838977 -0.0902438 -0.0435008 0.0637435 0.1440663 -0.1550871 0.0665502 -0.115103 0.0809316 0.0838977 0.0902438 0.0435008 0.0637435 0.0746677 0.187751 0. 0.1831859 -0.2124829 0. 0. 0. 0.0744386 0.1141442 0.0120791 -0.0379173 -0.0240051 0.0667276 0.0134965 -0.0284743 0.0340581 0.0716632 0.1141442 0.0120792 0.0379173 -0.0240051 0.0667276 -0.0134965 0.0284743 -0.0340581 0.0716632 0.0411856 -0.0132243 0. 0.0180208 0.0807585 0. 0. 0. 0.1316638 -0.0899914 0.0827142 0. 0.1580498 0.1929837 0. 0. 0. -0.0745236 0.1119888 -0.0011877 0. 0.0012175 0.1034984 0. 0. 0. 0.0923106 -0.3194018 -0.1327309 0. -0.1221519 0.1132244 0. 0. 0. 0.1554662 0.0633814 0.0309632 0. 0.0048513 0.0391084 0. 0. 0. 0.121323 0.2032241 0.0093553 0.0818149 0.0343936 -0.0492511 0.0924146 -0.1017645 0.0605514 0.1319009 0.1157844 -0.0187234 -0.0213218 -0.0107247 0.0903242 0.0244845 -0.0600428 -0.0080474 0.0594147 -0.0716245 0.0919609 -0.0044262 -0.0156526 0.0421879 0.0291426 -0.0766407 0.01966 -0.2010403 0.0534902 -0.0167276 -0.0171555 0.0095051 0.1105345 0.0097039 0.0371232 0.0103933 0.1239787 0.2032241 0.0093553 -0.0818149 0.0343936 -0.049251 -0.0924146 0.1017645 -0.0605514 0.1319009 0.1157844 -0.0187234 0.0213218 -0.0107247 0.0903242 -0.0244845 0.0600428 0.0080474 0.0594147 -0.0716244 0.0919609 0.0044262 -0.0156526 0.0421879 -0.0291426 0.0766407 -0.01966 -0.2010403 0.0534902 -0.0167276 0.0171555 0.0095051 0.1105345 -0.0097039 -0.0371232 -0.0103933 0.1239787 unknown
polarizability: 77.9609568|3.9868465|89.4186243|0.|0.|76.7884139 unknown
InChI: InChI=1/9C.9H
charge 1 multiplicity 1
18 atoms
C  0.05776174 -1.31221748 0.76970396
C  0.05776174 -1.31221748 -0.76970396
C  -1.31759475 -0.81176147 0.0000
H  -0.06224375 -2.29357198 1.23172899
H  -0.06224375 -2.29357198 -1.23172899
H  -2.13061944 -1.53730597 0.0000
C  -1.53711426 0.56014976 0.0000
H  -2.54811166 0.9707965 0.0000
C  -0.39246307 1.4412279 0.0000
H  -0.57728262 2.51808639 0.0000
C  0.77915484 1.00397027 0.93798024
H  1.40884399 1.80687334 1.3208547
C  0.77810315 -0.28081351 1.44997284
H  1.34019793 -0.5212672 2.35421617
C  0.77915484 1.00397027 -0.93798024
H  1.40884399 1.80687334 -1.3208547
C  0.77810315 -0.28081351 -1.44997284
H  1.34019793 -0.5212672 -2.35421617
