program: Gaussian 16
title: Title Card Required
version: ES64L-G16RevA.03
frameworkgroup: C3H[SGH(C3H3),X(C6H6)]
method: RPBE1PBE
basis: 6-31G(d)
operation: Freq
keyword: #N
keyword: Geom=AllCheck
keyword: Guess=TCheck
keyword: SCRF=Check
keyword: GenChk
keyword: RPBE1PBE/6-31G(d)
keyword: Freq
converged: YES YES YES YES
title: Mulliken charges:
elementType: C H C C H H C H C C H H C H C C H H
charge: 0.055228 0.268108 -0.270674 -0.270674 0.275672 0.275672 0.055228 0.268108 -0.270674 -0.270674 0.275672 0.275672 0.055228 0.268108 -0.270674 -0.270674 0.275672 0.275672
chargesum: 1.00000
title: Mulliken charges with hydrogens summed into heavy atoms:
elementType: C C C C C C C C C
charge: 0.323336 0.004999 0.004999 0.323336 0.004999 0.004999 0.323336 0.004999 0.004999
1716.lowfreq: -0.0028 -0.0027 -0.0024 5.4416 5.4416 9.4506 380.2254 409.8733 409.8733
frequency: 380.2254 409.8731 409.8731 496.0207 496.0207 553.7290 553.7290 585.4635 585.4635 600.3310 666.2150 790.6068 790.6068 836.9666 896.8385 910.8694 949.1111 949.1111 951.7439 951.7439 1012.2720 1012.2720 1081.9392 1084.4096 1112.4820 1112.4820 1155.6791 1155.6791 1177.7436 1189.8078 1211.5374 1334.6319 1334.6319 1441.2222 1472.3951 1472.3951 1488.3623 1591.3747 1591.3747 3250.4121 3250.4121 3256.9564 3257.1208 3257.1208 3264.4261 3266.9047 3266.9047 3271.8881
redmass: 3.4700 8.4956 8.4956 2.0214 2.0214 6.7781 6.7781 6.4495 6.4495 1.9259 6.3089 1.7158 1.7158 1.7340 2.8390 5.5376 1.0778 1.0778 2.8726 2.8726 1.5070 1.5070 1.2700 1.2389 1.5194 1.5194 1.0846 1.0846 1.4280 1.4676 1.4434 1.2231 1.2231 2.6415 2.0288 2.0288 2.4248 5.2544 5.2544 1.0894 1.0894 1.0886 1.0937 1.0937 1.0926 1.0979 1.0979 1.1001
irintensity: 0.0000 0.0000 0.0000 0.0089 0.0089 0.0000 0.0000 7.3243 7.3243 0.0000 0.0000 38.5023 38.5019 0.0000 0.6443 0.0000 0.0000 0.0000 8.8437 8.8438 21.2388 21.2389 0.0000 0.0000 9.8694 9.8694 0.0000 0.0000 38.4306 0.0000 41.3247 0.0000 0.0000 0.0000 24.5859 24.5859 7.2747 0.0000 0.0000 4.5491 4.5493 0.0000 0.0000 0.0000 28.6734 30.7226 30.7219 0.0000
temp: 298.150 k
press: 1.00000 atm
elementType: 6 1 6 6 1 1 6 1 6 6 1 1 6 1 6 6 1 1
symmnumber: 3
zpe: 401582.7 jmol-1
zpe.correction: 0.152955 hartree
zpe.thermalcorrener: 0.158995 hartree
zpe.thermalcorrenthalpy: 0.159939 hartree
zpe.thermalcorrgfe: 0.124413 hartree
zpe.sumelectzpe: -347.482833 hartree
zpe.sumelectthermal: -347.476793 hartree
zpe.sumelectthermalent: -347.475849 hartree
zpe.sumelectthermalfe: -347.511375 hartree
dipole: -0.0000 -0.0000 -0.0000
dipole: 0.0000
quadrupole: -41.9772 -41.9772 -33.7019
quadrupole: -0.0000 -0.0000 -0.0000
quadrupole: -2.7584 -2.7584 5.5169 -0.0000 -0.0000 -0.0000
hfenergy: -347.6357883 hartree
pointgroup: C03H [SGH(C3H3),X(C6H6)]
dipole: 0. 0. 0. debye
dipolederiv: -0.0764848 -0.00001 0. -0.0000042 -0.2347113 0. 0. 0. 0.2033852 0.0678082 0.0000074 0. -0.0000006 0.1404897 0. 0. 0. 0.1145785 0.2570889 -0.0000074 0.0000028 -0.000007 -0.0898134 0.1905442 -0.0000075 0.2239212 -0.087351 0.2570889 -0.0000074 -0.0000028 -0.000007 -0.0898134 -0.1905442 0.0000075 -0.2239212 -0.087351 0.153975 0.0000031 0.0000001 -0.0000008 0.0635305 0.0214041 -0.0000004 -0.0121528 0.0950364 0.153975 0.0000031 -0.0000001 -0.0000008 0.0635305 -0.0214041 0.0000004 0.0121528 0.0950364 -0.1951514 0.0685124 0. 0.0685196 -0.1160447 0. 0. 0. 0.2033852 0.1223191 -0.0314712 0. -0.0314732 0.0859789 0. 0. 0. 0.1145785 -0.0030833 0.1502158 0.1650161 0.1502156 0.1703588 -0.0952721 0.193923 -0.1119579 -0.087351 -0.0030833 0.1502158 -0.1650161 0.1502156 0.1703588 0.0952721 -0.193923 0.1119579 -0.087351 0.0861416 0.0391648 0.0185377 0.0391624 0.1313638 -0.0107001 -0.0105247 0.0060764 0.0950364 0.0861416 0.0391648 -0.0185377 0.0391624 0.1313638 0.0107001 0.0105247 -0.0060764 0.0950364 -0.1951564 -0.0685122 0. -0.0685057 -0.1160364 0. 0. 0. 0.203382 0.1223216 0.0314735 0. 0.0314685 0.0859777 0. 0. 0. 0.1145784 -0.0030937 -0.1502103 -0.1650154 -0.1502102 0.1703684 -0.0952701 -0.1939172 -0.1119643 -0.0873515 -0.0030937 -0.1502103 0.1650154 -0.1502102 0.1703684 0.0952701 0.1939172 0.1119643 -0.0873514 0.0861423 -0.0391626 -0.0185357 -0.0391657 0.1313638 -0.0107028 0.0105263 0.0060772 0.0950376 0.0861423 -0.0391626 0.0185357 -0.0391657 0.1313638 0.0107028 -0.0105263 -0.0060772 0.0950377 unknown
polarizability: 74.9969769|-0.0000244|74.9970055|0.|0.|85.8056149 unknown
InChI: InChI=1/9C.9H
charge 1 multiplicity 1
18 atoms
C  0.00000509 1.6312845 0.0000
H  -0.00000508 2.71614778 0.0000
C  0.00000783 0.9172072 1.20109865
C  0.00000783 0.9172072 -1.20109865
H  -0.00000304 1.42595314 -2.15893778
H  -0.00000304 1.42595314 2.15893778
C  1.41273103 -0.81564623 0.0000
H  2.35225527 -1.35806906 0.0000
C  0.79432058 -0.45860995 1.20109865
C  0.79432058 -0.45860995 -1.20109865
H  1.23491292 -0.71297351 -2.15893778
H  1.23491292 -0.71297351 2.15893778
C  -1.41273612 -0.81563741 0.0000
H  -2.35225019 -1.35807786 0.0000
C  -0.7943284 -0.4585964 1.20109865
C  -0.7943284 -0.4585964 -1.20109865
H  -1.23490988 -0.71297878 -2.15893778
H  -1.23490988 -0.71297878 2.15893778
