program: Gaussian 16
title: Title Card Required
version: ES64L-G16RevA.03
frameworkgroup: C2V[C2(CH),SGV(C4H4),X(C4H4)]
method: RM062X
basis: 6-31G(d)
operation: Freq
keyword: #N
keyword: Geom=AllCheck
keyword: Guess=TCheck
keyword: SCRF=Check
keyword: GenChk
keyword: RM062X/6-31G(d)
keyword: Freq
converged: YES YES YES YES
title: Mulliken charges:
elementType: C C C C H H C H C H H H C H C H C H
charge: -0.114617 -0.356719 -0.356719 -0.114617 0.251842 0.251842 0.009605 0.273391 0.009605 0.273391 0.247932 0.247932 -0.114617 0.251842 -0.114617 0.251842 -0.153695 0.256377
chargesum: 1.00000
title: Mulliken charges with hydrogens summed into heavy atoms:
elementType: C C C C C C C C C
charge: 0.137225 -0.108787 -0.108787 0.137225 0.282997 0.282997 0.137225 0.137225 0.102682
1716.lowfreq: -217.2229 -11.4102 -0.0012 -0.0010 -0.0010 10.2454 11.6113 302.5937 369.1699
frequency: -217.2212 302.5935 369.1699 376.4570 384.2143 424.9762 480.6285 513.7221 602.5095 705.7939 741.4575 786.0715 818.6095 831.3872 909.6553 913.9441 928.3363 937.6232 960.2489 964.2238 968.1830 1038.6447 1075.4378 1086.0808 1148.1851 1164.8563 1210.8284 1248.0942 1275.7937 1282.1885 1286.4289 1314.0379 1361.1981 1362.0326 1448.9656 1573.2846 1581.1784 1730.1588 1763.0235 3184.5974 3185.2785 3214.1525 3216.7134 3256.4995 3257.0244 3257.8129 3275.7137 3277.8250
redmass: 2.2430 3.6425 4.1601 2.9405 1.7417 3.1583 3.0986 6.0266 6.3709 1.2378 1.5897 2.2965 4.7099 2.6213 3.6070 1.9264 4.9012 2.9152 1.3702 1.6410 2.8412 2.4219 1.5354 1.5545 1.0152 1.1709 1.2897 1.1964 1.3154 1.3418 1.3413 1.2352 1.4665 1.3279 1.4933 2.7137 3.9625 6.1577 6.9944 1.0883 1.0887 1.0911 1.0924 1.0858 1.0950 1.0871 1.1058 1.1072
irintensity: 0.0000 0.0557 0.3405 0.2837 45.8865 0.0000 1.1392 3.5262 0.0000 5.1178 99.4288 55.0411 6.0728 0.2833 9.1841 6.0791 13.2802 0.0000 0.0000 0.4675 7.0341 0.1348 0.0946 0.0000 0.1339 15.4190 11.2108 60.8016 38.1792 0.0000 15.8790 0.0000 42.6649 0.6002 10.9845 8.7152 156.1432 8.3877 20.5192 1.3679 0.3724 0.0075 1.0235 0.0000 3.4929 15.7813 17.0923 10.5581
temp: 298.150 k
press: 1.00000 atm
elementType: 6 6 6 6 1 1 6 1 6 1 1 1 6 1 6 1 6 1
symmnumber: 2
zpe: 400724.1 jmol-1
zpe.correction: 0.152628 hartree
zpe.thermalcorrener: 0.158768 hartree
zpe.thermalcorrenthalpy: 0.159712 hartree
zpe.thermalcorrgfe: 0.123374 hartree
zpe.sumelectzpe: -347.703156 hartree
zpe.sumelectthermal: -347.697016 hartree
zpe.sumelectthermalent: -347.696072 hartree
zpe.sumelectthermalfe: -347.732411 hartree
dipole: -0.0000 -0.0000 2.0184
dipole: 2.0184
quadrupole: -44.6155 -33.2360 -40.0691
quadrupole: 0.0000 0.0000 -0.0000
quadrupole: -5.3086 6.0709 -0.7622 0.0000 0.0000 -0.0000
hfenergy: -347.8557842 hartree
pointgroup: C02V [C2(C1H1),SGV(C4H4),X(C4H4)]
dipole: 0. 0. 0.7941179 debye
dipolederiv: 0.1397787 0.0033594 -0.1700576 -0.2474045 -0.1073297 0.314018 -0.1282468 0.0148038 -0.0793103 -0.2342821 0. 0. 0. 0.2602026 -0.2738598 0. 0.0505033 -0.3671602 -0.2342821 0. 0. 0. 0.2602026 0.2738598 0. -0.0505033 -0.3671602 0.1397787 -0.0033594 -0.1700576 0.2474045 -0.1073297 -0.314018 -0.1282468 -0.0148038 -0.0793103 0.0810799 -0.005254 0.0488679 0.0340479 0.1130484 -0.0504971 0.0324254 0.000972 0.1413782 0.0810799 0.005254 0.0488679 -0.0340479 0.1130484 0.0504971 0.0324254 -0.000972 0.1413782 0.095221 0. 0. 0. 0.6876085 -0.0160539 0. -0.3754322 0.5781341 0.1596763 0. 0. 0. 0.0977732 -0.0050714 0. -0.0239251 0.0608302 0.095221 0. 0. 0. 0.6876085 0.0160539 0. 0.3754322 0.5781341 0.1596763 0. 0. 0. 0.0977732 0.0050714 0. 0.0239251 0.0608302 0.0606734 0. 0. 0. 0.0045331 -0.0112763 0. -0.0064583 0.0609184 0.0606734 0. 0. 0. 0.0045331 0.0112763 0. 0.0064583 0.0609184 0.1397787 0.0033594 0.1700576 -0.2474045 -0.1073297 -0.314018 0.1282468 -0.0148038 -0.0793103 0.0810799 -0.005254 -0.0488679 0.0340479 0.1130484 0.0504971 -0.0324254 -0.000972 0.1413782 0.1397787 -0.0033594 0.1700576 0.2474045 -0.1073297 0.314018 0.1282468 0.0148038 -0.0793103 0.0810799 0.005254 -0.0488679 -0.0340479 0.1130484 -0.0504971 -0.0324254 0.0009719 0.1413782 -0.2123911 0. 0. 0. -1.2072126 0. 0. 0. 0.0238619 0.1663794 0. 0. 0. 0.0841028 0. 0. 0. 0.0624214 unknown
polarizability: 61.6748318|0.|96.5150598|0.|0.|73.8615974 unknown
InChI: InChI=1/9C.9H
charge 1 multiplicity 1
18 atoms
C  1.24297155 0.65834599 -0.88881987
C  0.0000 1.37598313 -0.31146199
C  0.0000 -1.37598313 -0.31146199
C  1.24297155 -0.65834599 -0.88881987
H  2.03972549 1.27998794 -1.2808444
H  2.03972549 -1.27998794 -1.2808444
C  0.0000 1.21445483 1.15790933
H  0.0000 2.1185465 1.76608326
C  0.0000 -1.21445483 1.15790933
H  0.0000 -2.1185465 1.76608326
H  0.0000 -2.43246113 -0.57555121
H  0.0000 2.43246113 -0.57555121
C  -1.24297155 -0.65834599 -0.88881987
H  -2.03972549 -1.27998794 -1.2808444
C  -1.24297155 0.65834599 -0.88881987
H  -2.03972549 1.27998794 -1.2808444
C  0.0000 0.0000 1.82937508
H  0.0000 0.0000 2.91386321
