program: Gaussian 16
title: Title Card Required
version: ES64L-G16RevA.03
frameworkgroup: CS[SG(C3H3),X(C6H6)]
method: RM062X
basis: 6-31G(d)
operation: Freq
keyword: #N
keyword: Geom=AllCheck
keyword: Guess=TCheck
keyword: SCRF=Check
keyword: GenChk
keyword: RM062X/6-31G(d)
keyword: Freq
converged: YES YES YES YES
title: Mulliken charges:
elementType: C C C H H H C H C H C H C H C H C H
charge: -0.229979 -0.229979 -0.269768 0.271248 0.271248 0.275483 0.070834 0.273991 -0.322369 0.267081 -0.209536 0.267715 -0.006695 0.259621 -0.209536 0.267715 -0.006695 0.259621
chargesum: 1.00000
title: Mulliken charges with hydrogens summed into heavy atoms:
elementType: C C C C C C C C C
charge: 0.041269 0.041269 0.005716 0.344825 -0.055288 0.058179 0.252925 0.058179 0.252925
1716.lowfreq: -265.7223 -11.5944 -8.9037 0.0006 0.0006 0.0008 7.1982 299.0226 415.4114
frequency: -265.7222 299.0223 415.4113 474.5329 480.8373 503.1016 521.8624 595.7198 633.7332 674.1450 728.0250 755.9560 807.8109 848.8191 897.2549 914.9797 931.6117 933.3391 961.3563 983.0412 1011.8661 1020.1735 1075.4493 1086.2064 1102.4289 1134.6975 1160.6062 1167.3479 1184.3392 1191.7218 1271.6718 1323.7493 1337.9524 1428.8017 1449.1558 1464.4123 1543.3789 1625.9613 1641.3702 3229.3508 3247.0695 3251.4667 3257.2431 3258.9916 3261.2286 3278.5431 3279.8453 3281.6048
redmass: 6.2848 4.1027 5.1295 2.3143 2.4332 5.3442 6.5138 5.5229 2.4153 5.1819 2.9458 1.5199 1.5837 1.9182 2.5740 1.8314 2.0410 2.9288 1.4797 1.5694 1.2906 1.7890 1.7674 1.4760 1.2858 1.2613 1.1495 1.0953 1.1200 1.3257 2.0085 1.2376 1.2581 2.5570 1.9017 1.9806 3.0705 5.3226 6.0264 1.0917 1.0910 1.0910 1.0924 1.0911 1.0925 1.0995 1.0972 1.0983
irintensity: 27.2768 1.0357 1.7033 2.0771 1.3754 0.3024 3.9686 5.2530 1.1618 2.3038 19.0646 39.1551 25.2556 3.0644 8.4099 4.9035 29.6003 4.3206 1.6812 10.3572 0.0189 18.8135 9.1626 0.0082 0.0002 12.2810 1.3499 0.2476 2.9660 3.8699 39.8620 0.8785 1.3094 8.3801 30.3483 6.3740 15.3709 6.2557 0.0803 1.2702 0.2139 5.5067 20.1738 25.0781 16.1480 7.5790 25.5798 1.8168
temp: 298.150 k
press: 1.00000 atm
elementType: 6 6 6 1 1 1 6 1 6 1 6 1 6 1 6 1 6 1
symmnumber: 1
zpe: 400313.5 jmol-1
zpe.correction: 0.152471 hartree
zpe.thermalcorrener: 0.158283 hartree
zpe.thermalcorrenthalpy: 0.159227 hartree
zpe.thermalcorrgfe: 0.122914 hartree
zpe.sumelectzpe: -347.714023 hartree
zpe.sumelectthermal: -347.708211 hartree
zpe.sumelectthermalent: -347.707267 hartree
zpe.sumelectthermalfe: -347.743580 hartree
dipole: -0.5154 0.0375 -0.0000
dipole: 0.5168
quadrupole: -40.7721 -34.6744 -43.3142
quadrupole: 2.4094 -0.0000 -0.0000
quadrupole: -1.1852 4.9125 -3.7273 2.4094 -0.0000 -0.0000
hfenergy: -347.866494 hartree
pointgroup: CS [SG(C3H3),X(C6H6)]
dipole: -0.2029879 0.0114525 0. debye
dipolederiv: 0.239226 -0.1926096 -0.0119836 -0.1149153 0.0926692 -0.071982 -0.0603566 0.0039663 0.0789053 0.239226 -0.1926096 0.0119836 -0.1149153 0.0926692 0.0719821 0.0603566 -0.0039663 0.0789053 -0.055078 0.2810428 0. 0.3089612 -0.3535675 0. 0. 0. -0.0310364 0.1201381 0.0172467 -0.0363622 -0.0250627 0.0944142 0.0027717 -0.032163 0.0196997 0.0902785 0.1201381 0.0172467 0.0363621 -0.0250627 0.0944142 -0.0027717 0.032163 -0.0196997 0.0902785 0.0688542 0.0062849 0. 0.0288104 0.1006533 0. 0. 0. 0.1420687 -0.0168251 0.0892956 0. 0.154862 0.318488 0. 0. 0. -0.0719698 0.1417702 -0.0097911 0. -0.0087334 0.1151702 0. 0. 0. 0.1198246 -0.5395444 -0.2020345 0. -0.1226532 0.0945839 0. 0. 0. 0.0488569 0.0753321 0.0216756 0. 0.0003572 0.0696641 0. 0. 0. 0.1297712 0.2552661 0.0348613 0.1530306 0.0374876 -0.0585775 0.0701473 -0.1794955 -0.029933 0.1701483 0.1307408 -0.0106857 -0.0192954 0.0031899 0.1146222 0.0342022 -0.0612455 0.0049732 0.0746853 -0.1417466 0.085877 0.0194271 -0.0851663 -0.0342808 0.0225605 -0.0811051 0.031107 -0.2436511 0.059121 -0.0279264 -0.0237379 0.0036647 0.1186567 0.0079216 0.0552401 0.0109095 0.1608761 0.2552661 0.0348613 -0.1530306 0.0374876 -0.0585775 -0.0701473 0.1794955 0.029933 0.1701483 0.1307408 -0.0106857 0.0192954 0.0031899 0.1146222 -0.0342022 0.0612455 -0.0049732 0.0746853 -0.1417466 0.085877 -0.0194271 -0.0851663 -0.0342808 -0.0225605 0.0811051 -0.031107 -0.2436511 0.059121 -0.0279264 0.0237379 0.0036647 0.1186567 -0.0079216 -0.0552401 -0.0109095 0.1608761 unknown
polarizability: 75.3085056|3.5366179|87.500999|0.|0.|73.4383343 unknown
InChI: InChI=1/9C.9H
charge 1 multiplicity 1
18 atoms
C  0.05595632 -1.29763795 0.75289704
C  0.05595632 -1.29763795 -0.75289704
C  -1.3044785 -0.80783704 0.0000
H  -0.07529903 -2.27010902 1.21467573
H  -0.07529903 -2.27010902 -1.21467573
H  -2.11798392 -1.52199888 0.0000
C  -1.51196382 0.54935628 0.0000
H  -2.51597844 0.96147052 0.0000
C  -0.37063299 1.42457275 0.0000
H  -0.56561171 2.49253721 0.0000
C  0.75013279 1.00089669 0.96942126
H  1.38247621 1.79755894 1.34242843
C  0.77082561 -0.2727878 1.44387047
H  1.35945779 -0.53340128 2.31660039
C  0.75013279 1.00089669 -0.96942126
H  1.38247621 1.79755894 -1.34242843
C  0.77082561 -0.2727878 -1.44387047
H  1.35945779 -0.53340128 -2.31660039
