program: Gaussian 09
title: 000051714
version: EM64L-G09RevD.01
frameworkgroup: C1[X(C10H22N4)]
method: RPBEPBE
basis: SDD
operation: Freq
keyword: #pfreq=noraman
keyword: PBEPBE/SDD
title: #p freq=noraman PBEPBE/SDD
converged: YES YES NO NO
title: Mulliken charges:
elementType: N N N N C C C C C C C C C C H H H H H H H H H H H H H H H H H H H H H H
charge: -0.125620 -0.093622 -0.634114 -0.656457 -0.048528 -0.079001 -0.394902 -0.390192 -0.436421 -0.396189 -0.718716 -0.716282 -0.445711 0.202225 0.195216 0.204701 0.200100 0.184971 0.185053 0.200297 0.197205 0.210948 0.217704 0.204049 0.212165 0.218235 0.210679 0.211868 0.210285 0.222944 0.207441 0.190967 0.317118 0.289560 0.306761 0.335265
chargesum: 0.00000
title: Mulliken charges with hydrogens summed into heavy atoms:
elementType: N N N N C C C C C C C C C C
charge: -0.125620 -0.093622 -0.027437 -0.014432 0.146687 0.125700 -0.009830 -0.004842 -0.028268 0.025563 -0.077636 -0.071186 -0.047303 0.202225
polarizability: 1.74883633e+02 3.44121063e+00 1.23757684e+02 -2.72578095e+00 4.54867569e+00 1.17646393e+02
1716.lowfreq: -21.0826 -0.0008 -0.0006 -0.0005 5.4083 10.1097 18.3645 44.8394 51.8342
frequency: -4.6412 43.6660 51.4270 64.6580 121.3606 141.3627 156.1066 197.3864 206.2250 233.0963 245.7028 284.0887 291.3118 312.7722 340.2210 368.9244 398.1166 400.8963 408.5040 432.8683 438.9253 477.6481 508.2852 554.0057 558.7041 576.1140 644.3378 679.9833 702.4641 774.2992 801.6860 822.2529 850.3170 863.7281 894.2089 925.7048 930.4361 973.4361 994.4265 998.3420 1014.9697 1033.0445 1047.0215 1060.3659 1063.7657 1100.1562 1112.7743 1139.0921 1158.8118 1164.0414 1171.0941 1182.9341 1188.2127 1269.3071 1276.3329 1295.6572 1307.0095 1311.2070 1313.7756 1337.4287 1341.6982 1345.9729 1357.5371 1366.8796 1368.9822 1370.3361 1381.2087 1406.1789 1448.7383 1451.8894 1458.8017 1463.3637 1467.5559 1471.7690 1474.6902 1481.3616 1487.6111 1600.2122 1614.7800 1671.4488 2877.5848 2933.5408 2949.7135 2955.5727 2960.8315 2970.8677 2972.8460 2977.5058 2983.0540 2987.7625 3028.5512 3036.1705 3036.9948 3047.8110 3062.2615 3065.3889 3075.5912 3084.4932 3519.5228 3546.3481 3667.8955 3691.5895
redmass: 3.6042 3.5442 3.5274 2.9110 3.2597 2.5199 3.4246 1.0779 3.2351 2.2594 1.1243 2.2067 2.3502 3.2369 2.3053 1.2075 1.7482 1.4645 1.9974 2.0948 1.2413 2.4589 2.5162 3.0666 1.7387 1.9982 2.4083 4.8116 2.5263 1.3595 1.8637 2.4360 1.4555 2.4773 5.1565 1.7474 1.6966 1.6369 1.9554 2.3113 1.5373 1.4718 2.4489 1.6641 2.5446 1.2938 2.1291 1.9298 1.9611 2.9114 1.5173 2.1035 1.3184 1.6192 1.2328 1.3177 1.2929 1.6089 1.3819 1.3888 1.4542 1.4098 1.3383 1.3020 1.2552 1.2946 1.2959 4.3218 1.0871 1.0801 1.0820 1.0579 1.0593 1.0715 1.0728 1.0601 1.0705 1.2271 1.2817 3.5870 1.0586 1.0929 1.0731 1.0783 1.0782 1.0360 1.0380 1.0602 1.0617 1.0668 1.0976 1.0981 1.1028 1.1033 1.0991 1.0981 1.1003 1.0990 1.0450 1.0452 1.1015 1.1028
irintensity: 2.5492 1.5642 1.2780 1.5098 1.4434 0.0888 1.2656 0.0886 1.3466 7.2456 0.3002 0.7434 3.6685 24.8255 0.0192 73.5738 31.6293 94.7161 33.3720 59.1496 118.9710 24.0212 7.0978 0.4975 171.4446 89.0199 16.4939 78.6717 3.8183 0.7537 3.0922 0.4405 0.9512 7.1453 6.2548 1.0366 9.6280 13.0751 8.2934 7.1185 9.8027 6.5732 17.2947 15.8318 15.6624 3.8453 18.0417 10.8841 19.5413 59.2185 6.5805 7.9289 5.5949 21.3509 4.2693 8.7146 24.7355 29.7526 12.3843 2.6035 3.7762 2.5978 3.9219 11.3927 2.6352 55.9421 9.9927 128.0896 3.7169 22.8970 9.5004 3.4071 10.9852 1.3312 7.5100 4.7488 19.9139 120.8715 94.2332 604.7788 75.0632 24.9916 35.6727 28.2358 40.0630 9.4598 58.8224 34.6375 92.2458 16.9343 53.1718 29.3906 30.6443 90.4308 90.3211 34.1902 20.3239 56.0258 18.6428 13.5849 18.5942 20.3961
temp: 298.150 k
press: 1.00000 atm
elementType: 7 7 7 7 6 6 6 6 6 6 6 6 6 6 1 1 1 1 1 1 1 1 1 1 1 1 1 1 1 1 1 1 1 1 1 1
symmnumber: 1
zpe: 841440.8 jmol-1
zpe.correction: 0.320488 hartree
zpe.thermalcorrener: 0.335902 hartree
zpe.thermalcorrenthalpy: 0.336846 hartree
zpe.thermalcorrgfe: 0.278528 hartree
zpe.sumelectzpe: -612.102819 hartree
zpe.sumelectthermal: -612.087405 hartree
zpe.sumelectthermalent: -612.086461 hartree
zpe.sumelectthermalfe: -612.144779 hartree
dipole: -1.9535 -1.5916 -1.2336
dipole: 2.8056
quadrupole: -68.0349 -85.1232 -88.6448
quadrupole: 4.3591 4.0158 2.2530
quadrupole: 12.5661 -4.5223 -8.0438 4.3591 4.0158 2.2530
hfenergy: -612.4233074 hartree
pointgroup: C01 [X(C10H22N4)]
dipole: 0.7304054 -0.5697617 0.6001935 debye
polarizability: 174.9844138|-2.2463976|122.852599|2.536057|-5.2449108|118.4506972 unknown
InChI: InChI=1S/C10H22N4/c1-8-4-3-5-9(2)14(8)7-6-13-10(11)12/h8-9H,3-7,11-12H2,1-2H3
charge 0 multiplicity 1
36 atoms
N  -0.904736 0.075605 -0.069351
N  2.846627 0.560392 -0.026807
N  5.194279 0.450251 -0.135665
N  4.102268 -0.975617 1.378604
C  -1.3789 -1.115566 -0.815983
C  -1.889399 1.065801 0.429743
C  -2.50684 -1.819602 -0.016856
C  -3.014427 0.336908 1.210333
C  -3.620538 -0.831505 0.399055
C  0.422902 0.592397 -0.446944
C  -1.800279 -0.860978 -2.298874
C  -2.469316 2.041944 -0.642443
C  1.558776 -0.008299 0.4165
C  3.965575 0.029288 0.404116
H  -0.514294 -1.811331 -0.853259
H  -1.338385 1.694463 1.159771
H  -2.06567 -2.26197 0.898219
H  -2.925061 -2.647088 -0.622509
H  -3.799492 1.066109 1.489872
H  -2.584111 -0.069066 2.147101
H  -4.143931 -0.444465 -0.497607
H  -4.385141 -1.3558 1.003843
H  0.455073 1.691702 -0.325957
H  0.665005 0.396848 -1.513514
H  -2.771103 -0.34075 -2.372387
H  -1.045355 -0.247094 -2.823816
H  -1.888426 -1.822629 -2.839953
H  -3.187539 1.542444 -1.315812
H  -2.994219 2.882815 -0.149243
H  -1.658562 2.465498 -1.263429
H  1.338384 0.237539 1.480474
H  1.523744 -1.12186 0.330711
H  5.110381 1.14537 -0.876286
H  6.00797 0.513097 0.475499
H  4.922082 -1.578669 1.382617
H  3.274459 -1.291379 1.876234
