program: Gaussian 16
title: Title Card Required
version: ES64L-G16RevA.03
frameworkgroup: CS[SG(C3H3),X(C6H6)]
method: RM062X
basis: 6-31G(d)
operation: Freq
keyword: #N
keyword: Geom=AllCheck
keyword: Guess=TCheck
keyword: SCRF=Check
keyword: GenChk
keyword: RM062X/6-31G(d)
keyword: Freq
converged: YES YES NO YES
title: Mulliken charges:
elementType: C C C H H H C H C H C H C H C H C H
charge: -0.189481 -0.189481 -0.266631 0.273394 0.273394 0.279874 0.078291 0.283447 -0.386747 0.253763 -0.132137 0.252295 -0.076863 0.251794 -0.132137 0.252295 -0.076863 0.251794
chargesum: 1.00000
title: Mulliken charges with hydrogens summed into heavy atoms:
elementType: C C C C C C C C C
charge: 0.083913 0.083913 0.013243 0.361738 -0.132984 0.120158 0.174930 0.120158 0.174930
1716.lowfreq: -18.3258 -14.2860 -0.0008 -0.0006 -0.0005 7.9297 276.4050 281.7353 344.7798
frequency: 276.4047 281.7353 344.7786 410.9443 445.8617 527.9701 535.2674 558.8114 613.4949 673.5594 755.5876 769.3068 791.3795 868.6094 888.6113 897.9332 927.9955 932.0482 975.0621 980.1222 1017.1591 1047.5595 1053.8572 1063.3100 1123.3398 1164.8983 1177.0822 1184.7002 1207.4839 1248.3233 1331.5686 1335.5957 1348.7500 1417.6646 1429.4417 1449.9273 1595.5314 1714.0068 1715.7693 3197.7114 3227.3096 3233.2528 3243.1169 3246.8166 3248.0058 3273.1107 3273.9466 3287.2912
redmass: 3.7191 3.3009 3.3798 2.9720 3.0530 4.1087 5.0357 5.8483 2.7182 3.7642 1.5953 1.5597 2.1331 3.1085 2.2567 2.1297 2.4829 2.8929 1.4315 1.3622 1.7750 1.7530 2.0142 1.4104 1.2233 1.1899 1.0724 1.1225 1.1868 1.3283 1.2581 1.4331 1.4551 1.7492 2.8449 1.7542 3.9639 6.2375 6.6877 1.0897 1.0905 1.0918 1.0929 1.0893 1.0904 1.0999 1.0996 1.0978
irintensity: 13.8637 8.2226 14.1503 0.1197 5.3730 12.7489 11.1093 7.6401 0.8364 8.6269 52.7241 79.3527 1.4492 0.9715 1.6699 5.2454 44.4473 12.4355 6.9830 0.8908 9.7591 2.0779 11.9481 0.9130 0.0243 11.8328 0.7302 1.0386 0.2949 12.0554 1.8719 12.7353 30.3290 23.7232 12.4845 0.3687 25.3187 12.4647 1.3066 0.0803 0.9047 3.9277 12.5172 14.4682 12.3930 3.7151 10.1258 11.2153
temp: 298.150 k
press: 1.00000 atm
elementType: 6 6 6 1 1 1 6 1 6 1 6 1 6 1 6 1 6 1
symmnumber: 1
zpe: 402615.3 jmol-1
zpe.correction: 0.153348 hartree
zpe.thermalcorrener: 0.159769 hartree
zpe.thermalcorrenthalpy: 0.160713 hartree
zpe.thermalcorrgfe: 0.123324 hartree
zpe.sumelectzpe: -347.716097 hartree
zpe.sumelectthermal: -347.709676 hartree
zpe.sumelectthermalent: -347.708732 hartree
zpe.sumelectthermalfe: -347.746121 hartree
dipole: -1.3578 -0.3598 0.0000
dipole: 1.4046
quadrupole: -40.8963 -34.6903 -43.3343
quadrupole: 1.8180 0.0000 -0.0000
quadrupole: -1.2560 4.9500 -3.6940 1.8180 0.0000 -0.0000
hfenergy: -347.8694447 hartree
pointgroup: CS [SG(C3H3),X(C6H6)]
dipole: -0.5342765 -0.1411985 0. debye
dipolederiv: 0.4007074 -0.2213756 0.2056153 -0.0886066 0.2130672 -0.046539 -0.0291915 0.1217811 0.1975265 0.4007074 -0.2213756 -0.2056153 -0.0886067 0.2130672 0.046539 0.0291915 -0.1217811 0.1975265 -0.2578939 0.3796601 0. 0.4689174 -0.5569574 0. 0. 0. -0.3275291 0.0813591 0.0319377 -0.0334183 -0.0308376 0.0831841 0.0005609 -0.0275947 0.0118219 0.0867057 0.0813591 0.0319377 0.0334183 -0.0308376 0.0831841 -0.0005609 0.0275947 -0.0118219 0.0867057 0.07534 0.017832 0. 0.0376695 0.0996142 0. 0. 0. 0.1441215 0.149546 0.1059956 0. -0.0227212 0.5002748 0. 0. 0. -0.0169788 0.118514 -0.0094051 0. -0.0136166 0.1197787 0. 0. 0. 0.1835599 -0.4703933 -0.2761303 0. -0.0248291 0.2023079 0. 0. 0. -0.1692889 0.0669046 0.0181918 0. 0.0050672 0.0233398 0. 0. 0. 0.0850721 0.1455775 0.1049133 0.2488689 -0.0541772 -0.0352646 -0.0891072 0.0670263 -0.1088521 0.2337644 0.1269455 -0.0214 -0.0356493 0.0076693 0.1089866 0.0320064 -0.0734135 -0.0048574 0.0717883 -0.1746562 0.0217843 0.062102 -0.0433624 -0.173448 0.0428852 -0.0317142 0.0385447 -0.1916279 0.079058 -0.0339317 -0.0558906 -0.0159291 0.1092957 0.0078726 0.0151404 0.0214555 0.1523647 0.1455775 0.1049133 -0.2488689 -0.0541772 -0.0352646 0.0891072 -0.0670263 0.1088521 0.2337644 0.1269455 -0.0214 0.0356493 0.0076693 0.1089866 -0.0320064 0.0734135 0.0048574 0.0717883 -0.1746562 0.0217843 -0.0621021 -0.0433624 -0.173448 -0.0428852 0.0317142 -0.0385447 -0.1916279 0.079058 -0.0339317 0.0558906 -0.0159291 0.1092957 -0.0078726 -0.0151404 -0.0214555 0.1523647 unknown
polarizability: 69.8473507|3.3951665|90.0469696|0.|0.|70.1308449 unknown
InChI: InChI=1/9C.9H
charge 1 multiplicity 1
18 atoms
C  -0.02202098 -1.30665088 0.73167927
C  -0.02202098 -1.30665088 -0.73167927
C  -1.36390858 -0.70817555 0.0000
H  -0.27223521 -2.25090449 1.20732586
H  -0.27223521 -2.25090449 -1.20732586
H  -2.24083093 -1.34186101 0.0000
C  -1.41583684 0.65238442 0.0000
H  -2.36936732 1.1744238 0.0000
C  -0.15395685 1.41969416 0.0000
H  -0.3155718 2.4956932 0.0000
C  0.74596744 0.96389578 1.16134288
H  1.37987366 1.71257364 1.62264019
C  0.74511709 -0.32502624 1.50351803
H  1.33531365 -0.69815233 2.33423052
C  0.74596744 0.96389578 -1.16134288
H  1.37987366 1.71257364 -1.62264019
C  0.74511709 -0.32502624 -1.50351803
H  1.33531365 -0.69815233 -2.33423052
