program: Gaussian 16
title: Title Card Required
version: ES64L-G16RevA.03
frameworkgroup: C2V[C2(CH),SGV(C4H4),X(C4H4)]
method: RMN15
basis: 6-31G(d)
operation: Freq
keyword: #N
keyword: Geom=AllCheck
keyword: Guess=TCheck
keyword: SCRF=Check
keyword: GenChk
keyword: RMN15/6-31G(d)
keyword: Freq
converged: YES YES YES YES
title: Mulliken charges:
elementType: C C C C H H C H C H H H C H C H C H
charge: -0.083944 -0.298182 -0.298182 -0.083944 0.217299 0.217299 0.010987 0.242827 0.010987 0.242827 0.212531 0.212531 -0.083944 0.217299 -0.083944 0.217299 -0.090911 0.221166
chargesum: 1.00000
title: Mulliken charges with hydrogens summed into heavy atoms:
elementType: C C C C C C C C C
charge: 0.133355 -0.085651 -0.085651 0.133355 0.253814 0.253814 0.133355 0.133355 0.130255
1716.lowfreq: -254.1908 -18.7440 -5.0133 -0.0002 0.0010 0.0011 3.1123 293.2750 355.2064
frequency: -254.1904 293.2750 355.2058 366.0080 377.5103 411.5103 433.7332 498.6309 583.9603 695.1207 730.0365 781.3945 814.0308 830.5249 893.4584 909.2914 912.5885 935.2540 950.3190 951.8358 966.0457 1035.3840 1060.3256 1067.3738 1135.2417 1153.5304 1200.5352 1237.1357 1266.6926 1271.1684 1279.4015 1304.5089 1348.7291 1349.9548 1435.3081 1561.2995 1577.5461 1721.4583 1754.7182 3191.5379 3192.2476 3226.4111 3229.2239 3266.5388 3267.4277 3267.8581 3285.7668 3287.9820
redmass: 2.2350 3.6423 3.9998 2.9660 1.7517 3.1963 3.1465 6.0105 6.4215 1.2375 1.5750 2.0669 4.7219 2.5533 3.6613 5.1845 2.0687 2.2393 1.5492 1.6289 2.7711 2.3069 1.5245 1.5526 1.0149 1.1525 1.2712 1.1094 1.4401 1.3723 1.3640 1.2360 1.5050 1.3266 1.5069 2.8272 4.3816 6.2572 7.0840 1.0877 1.0882 1.0903 1.0921 1.0854 1.0950 1.0867 1.1055 1.1068
irintensity: 0.0000 0.0102 0.2916 0.1444 40.6268 0.0000 0.3895 3.0470 0.0000 3.7855 89.1567 53.6013 6.3382 0.7374 9.1874 10.9572 2.1808 0.0000 0.0000 0.2452 6.3153 0.0242 0.0715 0.0000 0.1888 12.8772 9.8676 28.9410 48.4365 0.0000 14.7848 0.0000 41.4722 0.2611 12.2342 8.5025 127.9732 9.4946 20.2580 3.6426 0.7060 0.1368 0.3618 0.0000 1.2423 8.7031 9.2508 6.6945
temp: 298.150 k
press: 1.00000 atm
elementType: 6 6 6 6 1 1 6 1 6 1 1 1 6 1 6 1 6 1
symmnumber: 2
zpe: 398745.5 jmol-1
zpe.correction: 0.151874 hartree
zpe.thermalcorrener: 0.158165 hartree
zpe.thermalcorrenthalpy: 0.159110 hartree
zpe.thermalcorrgfe: 0.122519 hartree
zpe.sumelectzpe: -347.429492 hartree
zpe.sumelectthermal: -347.423201 hartree
zpe.sumelectthermalent: -347.422257 hartree
zpe.sumelectthermalfe: -347.458847 hartree
dipole: 0.0000 0.0000 1.9975
dipole: 1.9975
quadrupole: -44.4249 -33.4248 -39.8922
quadrupole: -0.0000 0.0000 0.0000
quadrupole: -5.1776 5.8225 -0.6449 -0.0000 0.0000 0.0000
hfenergy: -347.5813665 hartree
pointgroup: C02V [C2(C1H1),SGV(C4H4),X(C4H4)]
dipole: 0. 0. 0.7858625 debye
dipolederiv: 0.1565541 0.0034173 -0.1730006 -0.2378573 -0.094743 0.2971724 -0.1304096 0.0073754 -0.0694846 -0.2272486 0. 0. 0. 0.2759306 -0.2750037 0. 0.0405779 -0.3497599 -0.2272486 0. 0. 0. 0.2759306 0.2750037 0. -0.0405779 -0.3497599 0.1565541 -0.0034173 -0.1730006 0.2378573 -0.094743 -0.2971724 -0.1304096 -0.0073754 -0.0694846 0.0650406 -0.0155317 0.0520402 0.0259093 0.1013341 -0.0446522 0.0336344 0.0025681 0.131857 0.0650406 0.0155317 0.0520402 -0.0259093 0.1013341 0.0446522 0.0336344 -0.0025681 0.131857 0.0935236 0. 0. 0. 0.6291695 -0.0019407 0. -0.3195824 0.5647195 0.153741 0. 0. 0. 0.0879273 -0.0116651 0. -0.0271255 0.0540804 0.0935236 0. 0. 0. 0.6291695 0.0019407 0. 0.3195824 0.5647195 0.153741 0. 0. 0. 0.0879273 0.0116651 0. 0.0271255 0.0540804 0.0565365 0. 0. 0. -0.0138794 -0.0150661 0. -0.0094599 0.0580263 0.0565365 0. 0. 0. -0.0138794 0.0150661 0. 0.0094599 0.0580263 0.1565541 0.0034173 0.1730006 -0.2378573 -0.094743 -0.2971724 0.1304096 -0.0073754 -0.0694845 0.0650406 -0.0155317 -0.0520401 0.0259093 0.1013341 0.0446522 -0.0336344 -0.0025681 0.131857 0.1565541 -0.0034173 0.1730006 0.2378573 -0.094743 0.2971724 0.1304096 0.0073754 -0.0694845 0.0650406 0.0155317 -0.0520402 -0.0259093 0.1013341 -0.0446521 -0.0336344 0.0025681 0.131857 -0.193941 0. 0. 0. -1.0639995 0. 0. 0. 0.0541882 0.1544572 0. 0. 0. 0.0793395 0. 0. 0. 0.0421894 unknown
polarizability: 62.0796399|0.|96.2501308|0.|0.|74.5909156 unknown
InChI: InChI=1/9C.9H
charge 1 multiplicity 1
18 atoms
C  1.24153258 0.65995716 -0.88949157
C  0.0000 1.37657399 -0.31271647
C  0.0000 -1.37657399 -0.31271647
C  1.24153258 -0.65995716 -0.88949157
H  2.04052374 1.28167853 -1.28014087
H  2.04052374 -1.28167853 -1.28014087
C  0.0000 1.21646296 1.15814441
H  0.0000 2.1216688 1.76648309
C  0.0000 -1.21646296 1.15814441
H  0.0000 -2.1216688 1.76648309
H  0.0000 -2.43425164 -0.57755046
H  0.0000 2.43425164 -0.57755046
C  -1.24153258 -0.65995716 -0.88949157
H  -2.04052374 -1.28167853 -1.28014087
C  -1.24153258 0.65995716 -0.88949157
H  -2.04052374 1.28167853 -1.28014087
C  0.0000 0.0000 1.83132116
H  0.0000 0.0000 2.91702745
