program: Gaussian 16
title: Title Card Required
version: ES64L-G16RevA.03
frameworkgroup: C2V[C2(CH),SGV(C4H4),X(C4H4)]
method: RwB97XD
basis: 6-31G(d)
operation: Freq
keyword: #N
keyword: Geom=AllCheck
keyword: Guess=TCheck
keyword: SCRF=Check
keyword: GenChk
keyword: RwB97XD/6-31G(d)
keyword: Freq
converged: YES YES YES YES
title: Mulliken charges:
elementType: C C C C H H C H C H H H C H C H C H
charge: -0.122700 -0.343773 -0.343773 -0.122700 0.253735 0.253735 0.004660 0.275241 0.004660 0.275241 0.248601 0.248601 -0.122700 0.253735 -0.122700 0.253735 -0.153182 0.259584
chargesum: 1.00000
title: Mulliken charges with hydrogens summed into heavy atoms:
elementType: C C C C C C C C C
charge: 0.131035 -0.095172 -0.095172 0.131035 0.279901 0.279901 0.131035 0.131035 0.106402
1716.lowfreq: -222.9376 -0.0006 -0.0006 -0.0005 6.4571 13.9768 26.1136 304.6149 373.6537
frequency: -222.9362 304.6147 373.6536 378.1626 390.9646 427.4922 474.1197 524.0821 606.4910 703.6459 739.3993 786.7005 818.6473 830.5287 915.4581 917.9431 940.3365 940.5723 957.7362 962.6492 967.1544 1038.0120 1076.0125 1087.6585 1165.4656 1178.4139 1219.0739 1265.5928 1293.8029 1298.8544 1299.5561 1328.4061 1369.6609 1371.3269 1456.8925 1574.3069 1588.9546 1728.7811 1761.6990 3176.5873 3177.4147 3211.2380 3214.3245 3249.6224 3255.6182 3256.8212 3275.8048 3277.9612
redmass: 2.2369 3.5821 4.0319 2.8791 1.7410 3.1484 3.1259 6.1077 6.4499 1.2371 1.5854 2.2680 4.8411 2.6544 1.9549 3.7168 3.8605 2.7667 1.4115 1.8275 2.8778 2.4976 1.5517 1.5660 1.0147 1.1907 1.3049 1.2025 1.3122 1.3426 1.3316 1.2325 1.4418 1.3197 1.4720 2.5724 3.8445 6.0130 6.8428 1.0883 1.0889 1.0906 1.0924 1.0955 1.0859 1.0871 1.1060 1.1074
irintensity: 0.0000 0.1441 0.3165 0.3440 44.5659 0.0000 0.5873 3.5537 0.0000 5.7794 103.1142 52.0033 5.6950 0.5467 7.1358 8.1528 10.9545 0.0000 0.0000 1.7512 5.7295 0.0393 0.0644 0.0000 0.1662 16.7842 10.4057 55.1338 34.5550 15.8519 0.0000 0.0000 38.9760 0.0804 12.1639 6.7960 136.4944 8.1242 19.0768 2.7982 0.5400 0.1414 0.3896 1.6969 0.0000 9.2968 9.8745 6.2797
temp: 298.150 k
press: 1.00000 atm
elementType: 6 6 6 6 1 1 6 1 6 1 1 1 6 1 6 1 6 1
symmnumber: 2
zpe: 401695.3 jmol-1
zpe.correction: 0.152998 hartree
zpe.thermalcorrener: 0.159105 hartree
zpe.thermalcorrenthalpy: 0.160050 hartree
zpe.thermalcorrgfe: 0.123763 hartree
zpe.sumelectzpe: -347.749555 hartree
zpe.sumelectthermal: -347.743447 hartree
zpe.sumelectthermalent: -347.742503 hartree
zpe.sumelectthermalfe: -347.778789 hartree
dipole: 0.0000 0.0000 2.0827
dipole: 2.0827
quadrupole: -44.2455 -32.7693 -39.6026
quadrupole: -0.0000 0.0000 0.0000
quadrupole: -5.3730 6.1032 -0.7301 -0.0000 0.0000 0.0000
hfenergy: -347.9025522 hartree
pointgroup: C02V [C2(C1H1),SGV(C4H4),X(C4H4)]
dipole: 0. 0. 0.8193932 debye
dipolederiv: 0.1388292 0.0024844 -0.1725964 -0.2347741 -0.0996932 0.2936099 -0.1308309 0.0083754 -0.0858778 -0.21309 0. 0. 0. 0.267517 -0.2670445 0. 0.0362925 -0.3383041 -0.21309 0. 0. 0. 0.267517 0.2670445 0. -0.0362925 -0.3383041 0.1388292 -0.0024844 -0.1725964 0.2347741 -0.0996932 -0.2936099 -0.1308309 -0.0083754 -0.0858778 0.0692281 -0.0168439 0.0573335 0.0251283 0.1057517 -0.042916 0.0385068 0.0039155 0.1396337 0.0692281 0.0168439 0.0573335 -0.0251283 0.1057517 0.042916 0.0385068 -0.0039155 0.1396337 0.0987631 0. 0. 0. 0.6534746 -0.0114233 0. -0.3325725 0.5715096 0.1584101 0. 0. 0. 0.0915923 -0.0122576 0. -0.0299352 0.0581193 0.0987631 0. 0. 0. 0.6534746 0.0114233 0. 0.3325725 0.5715096 0.1584101 0. 0. 0. 0.0915923 0.0122576 0. 0.0299352 0.0581193 0.0630506 0. 0. 0. -0.0082538 -0.0140535 0. -0.0106404 0.062674 0.0630507 0. 0. 0. -0.0082538 0.0140535 0. 0.0106404 0.062674 0.1388292 0.0024844 0.1725964 -0.2347742 -0.0996932 -0.2936099 0.1308309 -0.0083754 -0.0858778 0.0692282 -0.0168439 -0.0573335 0.0251284 0.1057517 0.042916 -0.0385068 -0.0039155 0.1396337 0.1388292 -0.0024844 0.1725964 0.2347741 -0.0996932 0.2936099 0.1308309 0.0083754 -0.0858778 0.0692282 0.0168439 -0.0573335 -0.0251283 0.1057517 -0.042916 -0.0385068 0.0039155 0.1396337 -0.2149332 0. 0. 0. -1.1191652 0. 0. 0. 0.0306089 0.168436 0. 0. 0. 0.0862708 0. 0. 0. 0.0463699 unknown
polarizability: 61.0266524|0.|95.3933049|0.|0.|73.0925479 unknown
InChI: InChI=1/9C.9H
charge 1 multiplicity 1
18 atoms
C  1.24236054 0.65869668 -0.88928082
C  0.0000 1.37538596 -0.31193324
C  0.0000 -1.37538596 -0.31193324
C  1.24236054 -0.65869668 -0.88928082
H  2.03983583 1.27853241 -1.28138842
H  2.03983583 -1.27853241 -1.28138842
C  0.0000 1.21414727 1.1592047
H  0.0000 2.11801935 1.76686524
C  0.0000 -1.21414727 1.1592047
H  0.0000 -2.11801935 1.76686524
H  0.0000 -2.43228089 -0.5759135
H  0.0000 2.43228089 -0.5759135
C  -1.24236054 -0.65869668 -0.88928082
H  -2.03983583 -1.27853241 -1.28138842
C  -1.24236054 0.65869668 -0.88928082
H  -2.03983583 1.27853241 -1.28138842
C  0.0000 0.0000 1.83007374
H  0.0000 0.0000 2.91469678
