program: Gaussian 16
title: Title Card Required
version: ES64L-G16RevA.03
frameworkgroup: C2V[C2(CH),SGV(C4H4),X(C4H4)]
method: RBHandHLYP
basis: 6-31G(d)
operation: Freq
keyword: #N
keyword: Geom=AllCheck
keyword: Guess=TCheck
keyword: SCRF=Check
keyword: GenChk
keyword: RBHandHLYP/6-31G(d)
keyword: Freq
converged: YES YES YES YES
title: Mulliken charges:
elementType: C C C C H H C H C H H H C H C H C H
charge: -0.116003 -0.328108 -0.328108 -0.116003 0.241836 0.241836 0.020849 0.268997 0.020849 0.268997 0.238876 0.238876 -0.116003 0.241836 -0.116003 0.241836 -0.154825 0.250266
chargesum: 1.00000
title: Mulliken charges with hydrogens summed into heavy atoms:
elementType: C C C C C C C C C
charge: 0.125833 -0.089232 -0.089232 0.125833 0.289846 0.289846 0.125833 0.125833 0.095441
1716.lowfreq: -191.6380 -5.0581 -4.7075 -0.0004 -0.0003 -0.0002 2.7339 312.6343 381.2588
frequency: -191.6380 312.6343 381.2588 388.3588 397.6947 445.0930 510.6605 537.4678 623.8846 731.0080 764.4447 811.1241 838.1719 848.1084 944.6837 946.7508 970.7906 975.3885 985.9231 1000.7347 1004.2250 1059.2326 1110.5874 1126.7445 1193.7894 1211.2140 1241.5528 1290.1058 1338.1074 1342.2783 1345.5478 1375.2059 1409.7492 1414.7122 1499.0923 1615.3788 1616.7518 1771.6570 1804.2646 3247.9481 3248.7010 3293.0229 3296.3945 3329.4118 3329.7448 3330.6560 3349.1822 3351.2573
redmass: 2.2536 3.5999 4.5077 2.8820 1.7319 3.1544 2.9970 5.9828 6.2459 1.2391 1.6340 2.2177 4.8135 2.6541 3.5984 1.9474 2.8773 4.2617 2.8671 1.3331 1.7610 2.3553 1.5581 1.5654 1.0146 1.2372 1.2665 1.1565 1.4509 1.3685 1.3807 1.2355 1.4444 1.3158 1.4537 2.5028 3.5435 5.8664 6.7170 1.0887 1.0890 1.0908 1.0924 1.0863 1.0954 1.0874 1.1052 1.1065
irintensity: 0.0000 0.0110 0.2328 0.1586 42.8214 0.0000 1.1356 3.1245 0.0000 4.8003 100.2214 48.2775 6.5339 0.1149 13.7924 6.7684 0.0000 10.6552 3.6311 0.0000 1.7284 0.2676 0.0017 0.0000 0.3107 17.3807 5.8084 48.0022 54.3291 14.1183 0.0000 0.0000 32.2605 0.0660 11.4225 6.2060 161.5042 6.4133 15.0512 3.7405 0.6325 0.1257 0.6432 0.0000 2.0916 8.0636 7.5980 4.9713
temp: 298.150 k
press: 1.00000 atm
elementType: 6 6 6 6 1 1 6 1 6 1 1 1 6 1 6 1 6 1
symmnumber: 2
zpe: 412476.6 jmol-1
zpe.correction: 0.157104 hartree
zpe.thermalcorrener: 0.163014 hartree
zpe.thermalcorrenthalpy: 0.163958 hartree
zpe.thermalcorrgfe: 0.127977 hartree
zpe.sumelectzpe: -347.642624 hartree
zpe.sumelectthermal: -347.636715 hartree
zpe.sumelectthermalent: -347.635771 hartree
zpe.sumelectthermalfe: -347.671751 hartree
dipole: -0.0000 0.0000 2.2376
dipole: 2.2376
quadrupole: -44.8597 -33.3512 -40.1450
quadrupole: -0.0000 0.0000 -0.0000
quadrupole: -5.4078 6.1008 -0.6930 -0.0000 0.0000 -0.0000
hfenergy: -347.7997285 hartree
pointgroup: C02V [C2(C1H1),SGV(C4H4),X(C4H4)]
dipole: 0. 0. 0.8803357 debye
dipolederiv: 0.1343191 0.0034725 -0.176292 -0.2096422 -0.0931809 0.2619221 -0.1321372 0.0072888 -0.0960309 -0.1978439 0. 0. 0. 0.2691557 -0.2541436 0. 0.0225648 -0.2944746 -0.1978439 0. 0. 0. 0.2691557 0.2541436 0. -0.0225648 -0.2944746 0.1343191 -0.0034725 -0.176292 0.2096421 -0.0931809 -0.2619221 -0.1321372 -0.0072888 -0.0960309 0.0643408 -0.0152736 0.0565795 0.0231991 0.0990668 -0.0388088 0.0397016 0.0041597 0.1386699 0.0643408 0.0152736 0.0565795 -0.0231991 0.0990668 0.0388088 0.0397016 -0.0041597 0.1386699 0.1237038 0. 0. 0. 0.7151396 -0.0058776 0. -0.3561133 0.5697019 0.1489763 0. 0. 0. 0.0988042 -0.0083346 0. -0.0264529 0.0562387 0.1237038 0. 0. 0. 0.7151396 0.0058776 0. 0.3561133 0.5697019 0.1489763 0. 0. 0. 0.0988042 0.0083346 0. 0.0264529 0.0562387 0.0583648 0. 0. 0. -0.0144456 -0.0143313 0. -0.0101374 0.0559369 0.0583648 0. 0. 0. -0.0144456 0.0143313 0. 0.0101374 0.0559369 0.1343191 0.0034725 0.176292 -0.2096422 -0.0931809 -0.2619221 0.1321372 -0.0072888 -0.0960309 0.0643408 -0.0152736 -0.0565795 0.0231991 0.0990668 0.0388088 -0.0397016 -0.0041597 0.1386699 0.134319 -0.0034725 0.176292 0.2096422 -0.0931809 0.2619221 0.1321372 0.0072888 -0.0960309 0.0643408 0.0152736 -0.0565795 -0.0231991 0.0990668 -0.0388088 -0.0397016 0.0041597 0.1386699 -0.230256 0. 0. 0. -1.2452428 0. 0. 0. 0.0060915 0.1692144 0. 0. 0. 0.0843914 0. 0. 0. 0.0485467 unknown
polarizability: 59.2407623|0.|93.9814137|0.|0.|70.0870288 unknown
InChI: InChI=1/9C.9H
charge 1 multiplicity 1
18 atoms
C  1.23950678 0.65540193 -0.88740805
C  0.0000 1.36539223 -0.31373191
C  0.0000 -1.36539223 -0.31373191
C  1.23950678 -0.65540193 -0.88740805
H  2.0335507 1.26888511 -1.27614403
H  2.0335507 -1.26888511 -1.27614403
C  0.0000 1.20712985 1.15742037
H  0.0000 2.1055239 1.75883985
C  0.0000 -1.20712985 1.15742037
H  0.0000 -2.1055239 1.75883985
H  0.0000 -2.41581725 -0.57221789
H  0.0000 2.41581725 -0.57221789
C  -1.23950678 -0.65540193 -0.88740805
H  -2.0335507 -1.26888511 -1.27614403
C  -1.23950678 0.65540193 -0.88740805
H  -2.0335507 1.26888511 -1.27614403
C  0.0000 0.0000 1.82773411
H  0.0000 0.0000 2.90439339
