program: Gaussian 16
title: Title Card Required
version: ES64L-G16RevA.03
frameworkgroup: CS[SG(C3H3),X(C6H6)]
method: RBHandHLYP
basis: 6-31G(d)
operation: Freq
keyword: #N
keyword: Geom=AllCheck
keyword: Guess=TCheck
keyword: SCRF=Check
keyword: GenChk
keyword: RBHandHLYP/6-31G(d)
keyword: Freq
converged: YES YES YES YES
title: Mulliken charges:
elementType: C C C H H H C H C H C H C H C H C H
charge: -0.164645 -0.164645 -0.276390 0.264760 0.264760 0.268783 0.092575 0.278883 -0.355720 0.243026 -0.131286 0.242828 -0.079879 0.242643 -0.131286 0.242828 -0.079879 0.242643
chargesum: 1.00000
title: Mulliken charges with hydrogens summed into heavy atoms:
elementType: C C C C C C C C C
charge: 0.100116 0.100116 -0.007607 0.371457 -0.112694 0.111542 0.162764 0.111542 0.162764
1716.lowfreq: -9.0614 -6.4203 -2.7226 -0.0005 0.0006 0.0007 226.2750 318.0436 343.7533
frequency: 226.2749 318.0436 343.7532 408.0713 468.7319 519.9437 552.5169 568.5470 633.5805 686.2291 779.2130 798.1267 820.5433 881.5695 903.5951 925.3821 961.7288 968.3405 1013.2541 1019.5765 1055.8022 1071.0322 1076.8137 1104.7912 1171.2142 1201.0003 1225.5606 1230.0039 1244.4519 1316.2052 1391.8074 1392.5323 1400.4397 1463.3791 1477.4682 1498.5858 1633.4943 1764.2170 1765.5872 3259.9106 3297.0425 3304.7981 3318.1803 3318.8069 3320.0528 3345.6816 3346.8216 3360.5882
redmass: 4.3573 3.0741 3.2197 2.8921 3.2871 3.9282 5.0294 5.5742 2.6530 4.1578 1.6049 1.5275 2.0289 3.1059 2.6164 2.1118 2.6378 2.5613 1.4839 1.3387 1.8248 1.9995 1.8229 1.4464 1.2182 1.2282 1.0737 1.1603 1.1528 1.3537 1.4275 1.2554 1.4496 1.6920 2.5917 1.6788 3.6511 6.3902 5.9886 1.0898 1.0906 1.0920 1.0926 1.0895 1.0906 1.0999 1.0996 1.0979
irintensity: 31.0492 3.5187 9.1728 0.2010 3.5197 9.5852 22.5255 6.9955 0.8658 11.2995 51.1102 85.0437 1.0297 0.6576 2.0455 7.8565 37.1303 15.1924 8.8027 0.2509 6.4671 14.6529 1.3421 2.3569 0.0255 13.0463 0.5369 1.0492 0.3767 10.3788 8.9558 1.6301 26.6316 24.5510 13.3971 0.2672 31.0237 1.4624 12.5445 0.9840 0.3887 1.6476 10.4834 8.0473 5.2612 1.4503 5.0901 7.8847
temp: 298.150 k
press: 1.00000 atm
elementType: 6 6 6 1 1 1 6 1 6 1 6 1 6 1 6 1 6 1
symmnumber: 1
zpe: 413628.5 jmol-1
zpe.correction: 0.157543 hartree
zpe.thermalcorrener: 0.163843 hartree
zpe.thermalcorrenthalpy: 0.164787 hartree
zpe.thermalcorrgfe: 0.127528 hartree
zpe.sumelectzpe: -347.648205 hartree
zpe.sumelectthermal: -347.641905 hartree
zpe.sumelectthermalent: -347.640961 hartree
zpe.sumelectthermalfe: -347.678220 hartree
dipole: -1.5254 -0.3483 -0.0000
dipole: 1.5647
quadrupole: -41.0560 -34.8700 -43.3859
quadrupole: 1.4145 -0.0000 -0.0000
quadrupole: -1.2854 4.9007 -3.6153 1.4145 -0.0000 -0.0000
hfenergy: -347.805748 hartree
pointgroup: CS [SG(C3H3),X(C6H6)]
dipole: -0.5991783 -0.1411902 0. debye
dipolederiv: 0.4572931 -0.238705 0.2326594 -0.1008964 0.248199 -0.0633927 -0.061837 0.1356168 0.2243801 0.4572931 -0.2387051 -0.2326595 -0.1008964 0.248199 0.0633927 0.061837 -0.1356168 0.2243801 -0.3387762 0.41587 0. 0.5472361 -0.6111357 0. 0. 0. -0.3840484 0.065271 0.0327529 -0.0328803 -0.0299452 0.0676048 0.0083868 -0.0264345 0.0181439 0.0808999 0.065271 0.0327529 0.0328803 -0.0299452 0.0676048 -0.0083868 0.0264345 -0.0181439 0.0808999 0.0590595 0.0082374 0. 0.0345077 0.0923104 0. 0. 0. 0.1430874 0.1600153 0.0808635 0. -0.1104723 0.5373687 0. 0. 0. 0.0245943 0.1100837 -0.0070316 0. -0.0087328 0.1180061 0. 0. 0. 0.1848323 -0.3865303 -0.2440258 0. -0.0230746 0.2411145 0. 0. 0. -0.1546534 0.0633851 0.020147 0. 0.0088867 0.0002387 0. 0. 0. 0.0762449 0.1091347 0.1097428 0.2386361 -0.0467938 -0.0233014 -0.0782688 0.0922184 -0.1057518 0.2242795 0.1196963 -0.0290051 -0.0454395 -0.0010557 0.0956808 0.0239239 -0.0722606 -0.0108115 0.0673092 -0.1622884 0.0150389 0.0789974 -0.0265546 -0.1789929 0.0422564 -0.0033538 0.0370552 -0.1721287 0.0772747 -0.0268547 -0.066388 -0.0189297 0.1018583 0.0110139 -0.0043057 0.0279061 0.1302314 0.1091347 0.1097428 -0.2386361 -0.0467939 -0.0233014 0.0782688 -0.0922184 0.1057518 0.2242795 0.1196963 -0.0290051 0.0454395 -0.0010557 0.0956808 -0.0239239 0.0722606 0.0108115 0.0673092 -0.1622884 0.0150389 -0.0789974 -0.0265546 -0.1789929 -0.0422564 0.0033538 -0.0370552 -0.1721287 0.0772747 -0.0268547 0.066388 -0.0189297 0.1018583 -0.011014 0.0043057 -0.0279061 0.1302314 unknown
polarizability: 66.4193968|2.4661639|88.1678773|0.|0.|67.4914702 unknown
InChI: InChI=1/9C.9H
charge 1 multiplicity 1
18 atoms
C  -0.01534532 -1.30294279 0.72554971
C  -0.01534532 -1.30294279 -0.72554971
C  -1.36205535 -0.7035262 0.0000
H  -0.26579645 -2.23849964 1.20058433
H  -0.26579645 -2.23849964 -1.20058433
H  -2.23668378 -1.32713396 0.0000
C  -1.40384478 0.65008339 0.0000
H  -2.34572072 1.17700118 0.0000
C  -0.13342188 1.40938593 0.0000
H  -0.29827891 2.47785051 0.0000
C  0.73508916 0.95994625 1.1790132
H  1.34601252 1.70379001 1.66017924
C  0.74399537 -0.32331112 1.50795906
H  1.32832693 -0.69899814 2.33155335
C  0.73508916 0.95994625 -1.1790132
H  1.34601252 1.70379001 -1.66017924
C  0.74399537 -0.32331112 -1.50795906
H  1.32832693 -0.69899814 -2.33155335
