program: Gaussian 16
title: Title Card Required
version: ES64L-G16RevA.03
frameworkgroup: C3H[SGH(C3H3),X(C6H6)]
method: RB3LYP
basis: 6-31G(d)
operation: Freq
keyword: #N
keyword: Geom=AllCheck
keyword: Guess=TCheck
keyword: SCRF=Check
keyword: GenChk
keyword: RB3LYP/6-31G(d)
keyword: Freq
converged: YES YES YES YES
title: Mulliken charges:
elementType: C H C C H H C H C C H H C H C C H H
charge: 0.065023 0.230154 -0.218636 -0.218636 0.237714 0.237714 0.065023 0.230154 -0.218636 -0.218636 0.237714 0.237714 0.065023 0.230154 -0.218636 -0.218636 0.237714 0.237714
chargesum: 1.00000
title: Mulliken charges with hydrogens summed into heavy atoms:
elementType: C C C C C C C C C
charge: 0.295177 0.019078 0.019078 0.295177 0.019078 0.019078 0.295177 0.019078 0.019078
1716.lowfreq: -10.0391 -10.0391 -5.2585 -0.0039 -0.0039 -0.0034 337.0686 337.0686 381.9565
frequency: 337.0685 337.0685 381.9565 489.1682 489.1682 548.0840 548.0840 551.8703 551.8703 599.2299 665.0719 780.3637 780.3637 830.5576 866.1445 889.2572 941.8906 941.8906 948.0304 948.0304 999.8309 999.8309 1077.0855 1079.0579 1104.3852 1104.3852 1154.1792 1154.1792 1159.4097 1175.3873 1200.0636 1335.4058 1335.4058 1417.6186 1462.8729 1462.8729 1476.7946 1566.0657 1566.0657 3231.0210 3231.0210 3236.6736 3238.4614 3238.4614 3245.6492 3245.9499 3245.9499 3251.5800
redmass: 8.5719 8.5719 3.4763 1.9441 1.9441 6.9185 6.9185 8.4502 8.4502 1.9063 6.3887 1.6827 1.6827 1.7526 3.1800 5.5209 1.0790 1.0790 2.8684 2.8684 1.5113 1.5113 1.2692 1.2367 1.5644 1.5644 1.0951 1.0951 2.0037 1.6009 1.1137 1.2197 1.2197 2.2944 1.9291 1.9291 2.2438 4.9413 4.9413 1.0893 1.0893 1.0885 1.0935 1.0935 1.0919 1.0975 1.0975 1.0991
irintensity: 0.0000 0.0000 0.0000 0.2320 0.2320 0.0000 0.0000 8.0462 8.0463 0.0000 0.0000 30.5059 30.5056 0.0000 0.0087 0.0000 0.0000 0.0000 7.1167 7.1168 19.4212 19.4210 0.0000 0.0000 11.7736 11.7739 0.0000 0.0000 62.9613 0.0000 12.7723 0.0000 0.0000 0.0000 19.5640 19.5653 8.7122 0.0000 0.0000 6.9574 6.9574 0.0000 0.0000 0.0000 18.6619 20.7920 20.7933 0.0000
temp: 298.150 k
press: 1.00000 atm
elementType: 6 1 6 6 1 1 6 1 6 6 1 1 6 1 6 6 1 1
symmnumber: 3
zpe: 397284.8 jmol-1
zpe.correction: 0.151318 hartree
zpe.thermalcorrener: 0.157602 hartree
zpe.thermalcorrenthalpy: 0.158546 hartree
zpe.thermalcorrgfe: 0.122592 hartree
zpe.sumelectzpe: -347.906093 hartree
zpe.sumelectthermal: -347.899810 hartree
zpe.sumelectthermalent: -347.898865 hartree
zpe.sumelectthermalfe: -347.934819 hartree
dipole: -0.0000 0.0000 0.0000
dipole: 0.0000
quadrupole: -42.1588 -42.1588 -34.3454
quadrupole: 0.0000 -0.0000 0.0000
quadrupole: -2.6045 -2.6045 5.2089 0.0000 -0.0000 0.0000
hfenergy: -348.0574112 hartree
pointgroup: C03H [SGH(C3H3),X(C6H6)]
dipole: 0. 0. 0. debye
dipolederiv: -0.0626774 0.0000026 0. 0.0000019 -0.2164502 0. 0. 0. 0.2055265 0.060467 -0.0000033 0. -0.0000001 0.1254246 0. 0. 0. 0.1096612 0.2522365 -0.0000072 -0.0000139 -0.0000006 -0.0709657 0.1981246 0.0000058 0.2212239 -0.074184 0.2522365 -0.0000072 0.0000139 -0.0000006 -0.0709657 -0.1981246 -0.0000058 -0.2212239 -0.074184 0.1453652 0. -0.0000045 0. 0.0533141 0.0269228 0.0000014 -0.0080512 0.0832537 0.1453652 0. 0.0000045 0. 0.0533141 -0.0269228 -0.0000014 0.0080512 0.0832537 -0.1780065 0.0665861 0. 0.0665856 -0.1011211 0. 0. 0. 0.2055265 0.1091865 -0.0281279 0. -0.0281255 0.0767052 0. 0. 0. 0.1096612 0.0098384 0.1399521 0.1715799 0.1399533 0.1714324 -0.099064 0.1915863 -0.1106107 -0.074184 0.0098384 0.1399521 -0.1715799 0.1399533 0.1714324 0.099064 -0.1915863 0.1106107 -0.074184 0.0763266 0.0398602 0.0233167 0.0398581 0.1223527 -0.0134599 -0.0069726 0.0040256 0.0832537 0.0763266 0.0398602 -0.0233167 0.0398581 0.1223527 0.0134599 0.0069726 -0.0040256 0.0832537 -0.1779996 -0.066583 0. -0.0665836 -0.1011178 0. 0. 0. 0.2055424 0.1091819 0.0281238 0. 0.0281266 0.0767093 0. 0. 0. 0.1096608 0.0098285 -0.1399515 -0.1715755 -0.1399476 0.1714375 -0.0990661 -0.1915981 -0.1106167 -0.0741873 0.0098285 -0.1399515 0.1715755 -0.1399476 0.1714375 0.0990661 0.1915981 0.1106167 -0.0741873 0.0763279 -0.0398586 -0.0233147 -0.0398597 0.1223531 -0.0134644 0.0069716 0.0040258 0.0832539 0.0763279 -0.0398586 0.0233147 -0.0398597 0.1223531 0.0134644 -0.0069716 -0.0040258 0.0832539 unknown
polarizability: 75.4177088|0.0002177|75.4174574|0.|0.|86.6339827 unknown
InChI: InChI=1/9C.9H
charge 1 multiplicity 1
18 atoms
C  -0.00000008 1.6387535 0.0000
H  -0.00000596 2.72291651 0.0000
C  0.00000621 0.92392477 1.20460594
C  0.00000621 0.92392477 -1.20460594
H  0.00000172 1.4328324 -2.16119676
H  0.00000172 1.4328324 2.16119676
C  1.41920196 -0.81937625 0.0000
H  2.3581176 -1.36145267 0.0000
C  0.80013897 -0.46196733 1.20460594
C  0.80013897 -0.46196733 -1.20460594
H  1.24086815 -0.71641726 -2.16119676
H  1.24086815 -0.71641726 2.16119676
C  -1.41920188 -0.81937639 0.0000
H  -2.35811164 -1.36146299 0.0000
C  -0.80014518 -0.46195658 1.20460594
C  -0.80014518 -0.46195658 -1.20460594
H  -1.24086987 -0.71641428 -2.16119676
H  -1.24086987 -0.71641428 2.16119676
