program: Gaussian 16
title: Title Card Required
version: ES64L-G16RevA.03
frameworkgroup: CS[SG(C3H3),X(C6H6)]
method: RPW6B95D3
basis: 6-31G(d)
operation: Freq
keyword: #N
keyword: Geom=AllCheck
keyword: Guess=TCheck
keyword: SCRF=Check
keyword: GenChk
keyword: RPW6B95D3/6-31G(d)Freq
converged: YES YES YES YES
title: Mulliken charges:
elementType: C C C H H H C H C H C H C H C H C H
charge: -0.219125 -0.219125 -0.258517 0.253421 0.253421 0.256932 0.104252 0.252464 -0.313020 0.248991 -0.197180 0.250303 0.027292 0.239736 -0.197180 0.250303 0.027292 0.239736
chargesum: 1.00000
title: Mulliken charges with hydrogens summed into heavy atoms:
elementType: C C C C C C C C C
charge: 0.034296 0.034296 -0.001585 0.356716 -0.064029 0.053123 0.267029 0.053123 0.267029
1716.lowfreq: -305.5073 -22.2348 -18.9699 -8.9867 -0.0007 -0.0005 0.0005 276.8391 404.5915
frequency: -305.5062 276.8369 404.5915 471.2721 479.0545 491.2099 517.4145 595.3894 626.8826 668.8610 723.4726 750.8742 802.1108 844.4829 894.9999 915.6001 926.5837 931.1407 949.1273 974.1646 1002.0632 1017.3131 1077.5307 1088.2344 1102.0615 1140.2761 1164.9638 1172.4571 1188.9577 1195.6176 1277.1126 1331.6383 1344.4143 1429.7241 1452.1159 1466.9273 1539.8004 1616.5079 1632.0150 3234.9540 3252.4986 3257.5740 3265.6096 3267.7936 3268.0199 3286.2346 3286.5615 3288.7506
redmass: 6.5873 4.3549 4.7168 2.3022 2.4767 5.3173 6.4674 5.3142 2.3292 5.0962 2.7619 1.5485 1.6072 2.0639 2.3669 1.8909 2.0963 2.8275 1.5322 1.5907 1.2660 1.7915 1.7837 1.4645 1.3147 1.2524 1.1486 1.0965 1.1894 1.2525 2.0770 1.2385 1.2593 2.5054 1.8599 1.9364 2.9383 5.2354 5.9083 1.0911 1.0904 1.0904 1.0909 1.0921 1.0916 1.0990 1.0970 1.0980
irintensity: 21.9417 1.0207 1.2498 1.2789 0.8351 0.5714 3.6166 3.9860 1.6418 1.7045 17.0559 34.7456 21.0982 4.6830 9.2975 5.4892 26.9421 3.1421 3.4933 8.6888 0.5993 18.0127 8.8628 0.0360 0.0000 11.4291 1.1865 0.2132 2.2715 3.3059 38.2209 0.8551 1.0538 6.1909 26.0246 5.9022 14.5121 4.4046 0.0660 0.4778 0.3844 3.6063 19.9109 26.5690 1.5322 5.5152 15.9841 4.4022
temp: 298.150 k
press: 1.00000 atm
elementType: 6 6 6 1 1 1 6 1 6 1 6 1 6 1 6 1 6 1
symmnumber: 1
zpe: 400101.8 jmol-1
zpe.correction: 0.152391 hartree
zpe.thermalcorrener: 0.158273 hartree
zpe.thermalcorrenthalpy: 0.159217 hartree
zpe.thermalcorrgfe: 0.122784 hartree
zpe.sumelectzpe: -348.347246 hartree
zpe.sumelectthermal: -348.341364 hartree
zpe.sumelectthermalent: -348.340420 hartree
zpe.sumelectthermalfe: -348.376853 hartree
dipole: -0.4657 0.0507 0.0000
dipole: 0.4684
quadrupole: -40.4350 -34.5467 -42.7232
quadrupole: 2.2992 0.0000 -0.0000
quadrupole: -1.2001 4.6883 -3.4882 2.2992 0.0000 -0.0000
hfenergy: -348.4996372 hartree
pointgroup: CS [SG(C3H3),X(C6H6)]
dipole: -0.1834949 0.0171226 0. debye
dipolederiv: 0.2188135 -0.1799978 -0.0184587 -0.1155045 0.0935115 -0.0733459 -0.0715714 -0.0053681 0.077654 0.2188135 -0.1799978 0.0184587 -0.1155045 0.0935115 0.0733459 0.0715713 0.0053681 0.077654 -0.0206189 0.2563226 0. 0.2850661 -0.3054018 0. 0. 0. -0.0051466 0.119018 0.0151916 -0.0355549 -0.0262861 0.0826596 0.0072441 -0.0312973 0.0258695 0.084705 0.119018 0.0151916 0.0355549 -0.0262861 0.0826596 -0.0072441 0.0312973 -0.0258695 0.084705 0.0591873 -0.002755 0. 0.0224444 0.091662 0. 0. 0. 0.1385752 -0.0413954 0.078437 0. 0.1547605 0.2788279 0. 0. 0. -0.0739481 0.1302311 -0.0055939 0. -0.0054791 0.1113734 0. 0. 0. 0.1092608 -0.4822969 -0.1691968 0. -0.1197566 0.1098193 0. 0. 0. 0.0893035 0.0727732 0.0242236 0. 0.0025701 0.0547044 0. 0. 0. 0.1249569 0.2396024 0.0264942 0.1375505 0.0420806 -0.0491923 0.0751362 -0.1610352 -0.0112186 0.1647562 0.1274259 -0.0153092 -0.0189331 -0.0033944 0.1044937 0.0302249 -0.0624339 0.0000692 0.0681335 -0.1148035 0.0863644 0.0165351 -0.07306 -0.017361 0.0213803 -0.0811796 0.0290911 -0.2343907 0.0510034 -0.0234619 -0.0285353 0.0063617 0.1153958 0.0107079 0.0507049 0.012727 0.1476412 0.2396024 0.0264942 -0.1375505 0.0420806 -0.0491923 -0.0751362 0.1610352 0.0112186 0.1647562 0.1274259 -0.0153092 0.0189331 -0.0033944 0.1044937 -0.0302249 0.0624339 -0.0000692 0.0681335 -0.1148035 0.0863644 -0.0165351 -0.07306 -0.017361 -0.0213803 0.0811796 -0.0290911 -0.2343907 0.0510034 -0.0234619 0.0285353 0.0063617 0.1153958 -0.0107079 -0.0507049 -0.012727 0.1476412 unknown
polarizability: 74.7460607|3.4587725|86.2565237|0.|0.|73.3775575 unknown
InChI: InChI=1/9C.9H
charge 1 multiplicity 1
18 atoms
C  0.05486969 -1.29372874 0.75232812
C  0.05486969 -1.29372874 -0.75232812
C  -1.29961377 -0.80542997 0.0000
H  -0.07162846 -2.26423469 1.21211244
H  -0.07162846 -2.26423469 -1.21211244
H  -2.11063029 -1.51778444 0.0000
C  -1.50989107 0.54966201 0.0000
H  -2.51011361 0.96090085 0.0000
C  -0.36941627 1.41983975 0.0000
H  -0.56442615 2.4847439 0.0000
C  0.748657 0.9984517 0.96423722
H  1.38001337 1.79187817 1.33594015
C  0.76836872 -0.27344445 1.44017084
H  1.35199026 -0.53131803 2.31297126
C  0.748657 0.9984517 -0.96423722
H  1.38001337 1.79187817 -1.33594015
C  0.76836872 -0.27344445 -1.44017084
H  1.35199026 -0.53131803 -2.31297126
