program: Gaussian 16
title: Title Card Required
version: ES64L-G16RevA.03
frameworkgroup: C2V[C2(CH),SGV(C4H4),X(C4H4)]
method: RN12SX
basis: 6-31G(d)
operation: Freq
keyword: #N
keyword: Geom=AllCheck
keyword: Guess=TCheck
keyword: SCRF=Check
keyword: GenChk
keyword: RN12SX/6-31G(d)
keyword: Freq
converged: YES YES YES YES
title: Mulliken charges:
elementType: C C C C H H C H C H H H C H C H C H
charge: -0.102974 -0.356333 -0.356333 -0.102974 0.243025 0.243025 0.015147 0.263175 0.015147 0.263175 0.239695 0.239695 -0.102974 0.243025 -0.102974 0.243025 -0.129021 0.245452
chargesum: 1.00000
title: Mulliken charges with hydrogens summed into heavy atoms:
elementType: C C C C C C C C C
charge: 0.140051 -0.116638 -0.116638 0.140051 0.278321 0.278321 0.140051 0.140051 0.116432
1716.lowfreq: -267.0245 -7.5653 -0.0009 -0.0008 -0.0005 3.0038 9.0473 303.5815 367.7576
frequency: -267.0244 303.5815 367.7576 377.5688 396.0495 422.5399 425.8065 517.8267 601.5882 699.3205 737.8269 788.4661 823.4477 837.7339 915.0380 916.8419 931.2943 935.1418 952.6922 952.6942 972.0262 1042.1799 1071.5150 1080.1833 1158.8746 1173.9221 1219.8461 1264.3630 1286.3021 1288.9647 1297.1648 1326.4887 1369.4869 1372.3247 1457.5122 1573.6248 1591.7781 1721.5488 1755.6716 3203.3031 3204.0531 3240.1925 3243.4788 3276.1503 3276.8019 3277.4628 3295.6883 3298.1071
redmass: 2.2085 3.5771 3.1064 2.9239 1.7513 3.1614 3.7768 6.0992 6.5370 1.2374 1.5506 2.1829 4.9189 2.6182 3.7428 2.0197 3.5565 2.0951 1.7134 1.9802 2.8648 2.4641 1.5409 1.5651 1.0145 1.1676 1.3014 1.1450 1.3628 1.3227 1.3477 1.2311 1.4758 1.3300 1.4822 2.6261 4.0431 6.0227 6.9149 1.0881 1.0886 1.0905 1.0922 1.0855 1.0951 1.0867 1.1051 1.1065
irintensity: 0.0000 0.2968 0.3488 0.3486 41.9532 0.0000 0.1424 3.2861 0.0000 5.4042 98.0718 52.8450 4.9810 1.1232 7.4574 5.1933 9.5562 0.0000 0.0000 2.3002 5.2370 0.0487 0.1190 0.0000 0.1622 14.9577 10.2790 37.4410 40.4710 0.0000 15.9436 0.0000 41.9530 0.0299 12.8154 5.7041 118.4035 9.3475 20.5077 1.8908 0.4631 0.0307 1.1858 0.0000 2.4013 13.0434 17.0454 10.9816
temp: 298.150 k
press: 1.00000 atm
elementType: 6 6 6 6 1 1 6 1 6 1 1 1 6 1 6 1 6 1
symmnumber: 2
zpe: 402197.9 jmol-1
zpe.correction: 0.153189 hartree
zpe.thermalcorrener: 0.159358 hartree
zpe.thermalcorrenthalpy: 0.160303 hartree
zpe.thermalcorrgfe: 0.123923 hartree
zpe.sumelectzpe: -347.709033 hartree
zpe.sumelectthermal: -347.702864 hartree
zpe.sumelectthermalent: -347.701919 hartree
zpe.sumelectthermalfe: -347.738299 hartree
dipole: -0.0000 0.0000 1.9623
dipole: 1.9623
quadrupole: -43.8639 -32.6522 -39.3888
quadrupole: -0.0000 -0.0000 -0.0000
quadrupole: -5.2289 5.9827 -0.7538 -0.0000 -0.0000 -0.0000
hfenergy: -347.862222 hartree
pointgroup: C02V [C2(C1H1),SGV(C4H4),X(C4H4)]
dipole: 0. 0. 0.7720145 debye
dipolederiv: 0.1326895 -0.0107239 -0.1584474 -0.2568272 -0.104532 0.3095877 -0.1235804 0.0125996 -0.0822481 -0.2115338 0. 0. 0. 0.2612435 -0.2706938 0. 0.0364212 -0.3345271 -0.2115338 0. 0. 0. 0.2612435 0.2706938 0. -0.0364212 -0.3345271 0.1326895 0.010724 -0.1584474 0.2568272 -0.1045319 -0.3095877 -0.1235804 -0.0125996 -0.0822481 0.0792286 -0.0132321 0.0476879 0.0332444 0.1118171 -0.0510173 0.0310428 -0.0003255 0.1411715 0.0792286 0.0132321 0.0476879 -0.0332444 0.1118171 0.0510173 0.0310428 0.0003255 0.1411715 0.0862958 0. 0. 0. 0.5941084 -0.0060156 0. -0.3028542 0.54636 0.1579416 0. 0. 0. 0.0966248 -0.0091173 0. -0.0259617 0.0621582 0.0862958 0. 0. 0. 0.5941084 0.0060156 0. 0.3028542 0.54636 0.1579416 0. 0. 0. 0.0966248 0.0091173 0. 0.0259617 0.0621582 0.0618869 0. 0. 0. 0.0010713 -0.012773 0. -0.0087333 0.0649551 0.0618869 0. 0. 0. 0.0010713 0.012773 0. 0.0087333 0.0649551 0.1326895 -0.0107239 0.1584474 -0.2568272 -0.1045319 -0.3095876 0.1235804 -0.0125996 -0.0822481 0.0792286 -0.0132321 -0.0476879 0.0332444 0.1118171 0.0510173 -0.0310428 0.0003255 0.1411715 0.1326895 0.0107239 0.1584474 0.2568272 -0.104532 0.3095877 0.1235804 0.0125996 -0.0822481 0.0792286 0.0132321 -0.0476879 -0.0332444 0.1118171 -0.0510173 -0.0310428 -0.0003255 0.1411715 -0.1994628 0. 0. 0. -1.0215433 0. 0. 0. 0.0335612 0.1626094 0. 0. 0. 0.0863069 0. 0. 0. 0.0528528 unknown
polarizability: 61.1855426|0.|94.2867786|0.|0.|73.6393705 unknown
InChI: InChI=1/9C.9H
charge 1 multiplicity 1
18 atoms
C  1.23616528 0.6577839 -0.88603128
C  0.0000 1.37402068 -0.31052916
C  0.0000 -1.37402068 -0.31052916
C  1.23616528 -0.6577839 -0.88603128
H  2.03095886 1.27699735 -1.27585494
H  2.03095886 -1.27699735 -1.27585494
C  0.0000 1.21340372 1.1548756
H  0.0000 2.1136423 1.76096651
C  0.0000 -1.21340372 1.1548756
H  0.0000 -2.1136423 1.76096651
H  0.0000 -2.42664331 -0.57557009
H  0.0000 2.42664331 -0.57557009
C  -1.23616528 -0.6577839 -0.88603128
H  -2.03095886 -1.27699735 -1.27585494
C  -1.23616528 0.6577839 -0.88603128
H  -2.03095886 1.27699735 -1.27585494
C  0.0000 0.0000 1.82283744
H  0.0000 0.0000 2.90376169
