program: Gaussian 16
title: Title Card Required
version: ES64L-G16RevA.03
frameworkgroup: C3H[SGH(C3H3),X(C6H6)]
method: RX3LYP
basis: 6-31G(d)
operation: Freq
keyword: #N
keyword: Geom=AllCheck
keyword: Guess=TCheck
keyword: SCRF=Check
keyword: GenChk
keyword: RX3LYP/6-31G(d)
keyword: Freq
converged: YES YES YES YES
title: Mulliken charges:
elementType: C H C C H H C H C C H H C H C C H H
charge: 0.065384 0.230323 -0.219042 -0.219042 0.237855 0.237855 0.065384 0.230323 -0.219042 -0.219042 0.237855 0.237855 0.065384 0.230323 -0.219042 -0.219042 0.237855 0.237855
chargesum: 1.00000
title: Mulliken charges with hydrogens summed into heavy atoms:
elementType: C C C C C C C C C
charge: 0.295706 0.018813 0.018813 0.295706 0.018813 0.018813 0.295706 0.018813 0.018813
1716.lowfreq: -10.0201 -10.0201 -5.5961 -0.0038 -0.0038 -0.0033 332.4280 332.4280 383.4549
frequency: 332.4280 332.4280 383.4549 490.9372 490.9372 547.9158 547.9158 550.5671 550.5671 602.0985 664.9146 782.8106 782.8106 834.5442 865.4125 888.3979 943.6084 943.6084 949.9456 949.9456 1001.7559 1001.7559 1079.4868 1081.4658 1104.7184 1104.7184 1154.3428 1154.3428 1157.2924 1174.8100 1200.1563 1336.8250 1336.8250 1418.7559 1463.7754 1463.7754 1477.5225 1566.9532 1566.9532 3231.7189 3231.7189 3237.5564 3238.6645 3238.6645 3245.8148 3246.8470 3246.8470 3252.1774
redmass: 8.5626 8.5626 3.4766 1.9544 1.9544 6.9302 6.9302 8.4950 8.4950 1.9198 6.3974 1.6749 1.6749 1.7396 3.2048 5.5098 1.0793 1.0793 2.9152 2.9152 1.4990 1.4990 1.2691 1.2376 1.5642 1.5642 1.0959 1.0959 2.0251 1.6015 1.1076 1.2199 1.2199 2.2944 1.9266 1.9266 2.2300 4.9103 4.9103 1.0895 1.0895 1.0884 1.0936 1.0936 1.0919 1.0974 1.0974 1.0991
irintensity: 0.0000 0.0000 0.0000 0.2863 0.2862 0.0000 0.0000 8.4865 8.4864 0.0000 0.0000 30.1660 30.1678 0.0000 0.0008 0.0000 0.0000 0.0000 7.8197 7.8195 18.5724 18.5726 0.0000 0.0000 12.1901 12.1900 0.0000 0.0000 64.0349 0.0000 12.2257 0.0000 0.0000 0.0000 20.0965 20.0976 8.9602 0.0000 0.0000 6.1468 6.1469 0.0000 0.0000 0.0000 19.9639 22.8099 22.8104 0.0000
temp: 298.150 k
press: 1.00000 atm
elementType: 6 1 6 6 1 1 6 1 6 6 1 1 6 1 6 6 1 1
symmnumber: 3
zpe: 397468.2 jmol-1
zpe.correction: 0.151388 hartree
zpe.thermalcorrener: 0.157674 hartree
zpe.thermalcorrenthalpy: 0.158618 hartree
zpe.thermalcorrgfe: 0.122655 hartree
zpe.sumelectzpe: -347.697049 hartree
zpe.sumelectthermal: -347.690763 hartree
zpe.sumelectthermalent: -347.689819 hartree
zpe.sumelectthermalfe: -347.725782 hartree
dipole: -0.0000 0.0000 0.0000
dipole: 0.0000
quadrupole: -42.2005 -42.2005 -34.4006
quadrupole: 0.0000 -0.0000 -0.0000
quadrupole: -2.6000 -2.6000 5.2000 0.0000 -0.0000 -0.0000
hfenergy: -347.848437 hartree
pointgroup: C03H [SGH(C3H3),X(C6H6)]
dipole: 0. 0. 0. debye
dipolederiv: -0.0627432 0.0000017 0. 0.0000035 -0.2181799 0. 0. 0. 0.2064901 0.0598032 -0.0000023 0. -0.0000004 0.1282093 0. 0. 0. 0.1098827 0.2542566 -0.0000069 -0.0000149 0.0000002 -0.0741777 0.1991797 0.0000062 0.2237178 -0.0765147 0.2542566 -0.0000069 0.0000149 0.0000002 -0.0741777 -0.1991797 -0.0000062 -0.2237178 -0.0765147 0.1456698 0. -0.000005 -0.0000004 0.0540397 0.0261337 0.0000012 -0.0089981 0.084993 0.1456698 0. 0.000005 -0.0000004 0.0540397 -0.0261337 -0.0000012 0.0089981 0.084993 -0.1793201 0.0673064 0. 0.0673066 -0.101603 0. 0. 0. 0.2064901 0.1111088 -0.029621 0. -0.0296191 0.0769037 0. 0. 0. 0.1098827 0.0079343 0.1422177 0.1724939 0.1422187 0.1721445 -0.0995913 0.1937461 -0.1118575 -0.0765147 0.0079343 0.1422177 -0.1724939 0.1422187 0.1721445 0.0995913 -0.1937461 0.1118575 -0.0765147 0.076947 0.0396779 0.0226333 0.0396758 0.1227625 -0.0130653 -0.0077926 0.004499 0.084993 0.076947 0.0396779 -0.0226333 0.0396758 0.1227625 0.0130653 0.0077926 -0.004499 0.084993 -0.1793133 -0.0673034 0. -0.0673024 -0.1016007 0. 0. 0. 0.2065064 0.1111045 0.0296169 0. 0.0296188 0.0769078 0. 0. 0. 0.1098832 0.0079235 -0.1422179 -0.1724872 -0.1422138 0.1721487 -0.0995932 -0.1937583 -0.1118638 -0.0765212 0.0079235 -0.1422179 0.1724872 -0.1422138 0.1721487 0.0995932 0.1937583 0.1118638 -0.0765212 0.0769486 -0.0396764 -0.0226303 -0.0396776 0.1227636 -0.0130695 0.0077921 0.0044995 0.0849941 0.0769486 -0.0396764 0.0226303 -0.0396776 0.1227636 0.0130695 -0.0077921 -0.0044995 0.0849941 unknown
polarizability: 75.4361888|0.0001691|75.4359936|0.|0.|86.5843929 unknown
InChI: InChI=1/9C.9H
charge 1 multiplicity 1
18 atoms
C  0.00000047 1.63924405 0.0000
H  -0.00000536 2.72369738 0.0000
C  0.00000611 0.92421943 1.20468583
C  0.00000611 0.92421943 -1.20468583
H  0.0000009 1.43350436 -2.16139793
H  0.0000009 1.43350436 2.16139793
C  1.4196265 -0.819622 0.0000
H  2.35879356 -1.36184361 0.0000
C  0.8003942 -0.46211458 1.20468583
C  0.8003942 -0.46211458 -1.20468583
H  1.24145049 -0.71675253 -2.16139793
H  1.24145049 -0.71675253 2.16139793
C  -1.41962697 -0.81962119 0.0000
H  -2.35878819 -1.36185291 0.0000
C  -0.80040031 -0.462104 1.20468583
C  -0.80040031 -0.462104 -1.20468583
H  -1.2414514 -0.71675097 -2.16139793
H  -1.2414514 -0.71675097 2.16139793
