program: Gaussian 16
title: Title Card Required
version: ES64L-G16RevA.03
frameworkgroup: CS[SG(C3H3),X(C6H6)]
method: RB3LYP
basis: 6-31G(d)
operation: Freq
keyword: #N
keyword: Geom=AllCheck
keyword: Guess=TCheck
keyword: SCRF=Check
keyword: GenChk
keyword: RB3LYP/6-31G(d)
keyword: Freq
converged: YES YES YES YES
title: Mulliken charges:
elementType: C C C H H H C H C H C H C H C H C H
charge: -0.198038 -0.198038 -0.228820 0.236087 0.236087 0.239620 0.079473 0.236055 -0.246703 0.232326 -0.192841 0.236511 0.035418 0.226887 -0.192841 0.236511 0.035418 0.226887
chargesum: 1.00000
title: Mulliken charges with hydrogens summed into heavy atoms:
elementType: C C C C C C C C C
charge: 0.038049 0.038049 0.010800 0.315528 -0.014378 0.043670 0.262306 0.043670 0.262306
1716.lowfreq: -299.3253 -15.3722 -14.8681 -11.4182 -0.0007 -0.0004 -0.0004 233.7385 393.7075
frequency: -299.3253 233.7385 393.7075 478.8535 483.8037 497.9402 519.3206 577.1977 622.9779 666.1042 686.8437 748.7056 797.7524 825.5485 886.2024 898.6938 921.3816 928.1295 943.8900 965.8864 990.5973 1005.6929 1069.9461 1078.8947 1088.6796 1118.7193 1156.9196 1164.0983 1176.8776 1185.2175 1238.7394 1329.5792 1338.1746 1413.1336 1443.0186 1457.5512 1508.4734 1579.3029 1588.3135 3204.1353 3218.8037 3223.5302 3230.6418 3233.2753 3233.9318 3249.7764 3249.8045 3252.8963
redmass: 7.2105 5.5046 4.0120 2.2833 2.3531 5.2599 7.0020 5.8856 2.2084 5.9370 3.5916 1.5332 1.6889 1.7672 2.8109 2.8040 1.4761 2.1270 1.7827 1.5192 1.3128 1.8145 1.8244 1.4971 1.3075 1.2667 1.1876 1.0948 1.4799 1.1362 1.8780 1.2323 1.2477 2.2689 1.8141 1.8793 2.5285 4.9074 5.3971 1.0913 1.0904 1.0900 1.0914 1.0929 1.0908 1.0981 1.0967 1.0969
irintensity: 13.6802 0.0358 0.0205 0.7160 0.2615 1.3996 4.8036 4.0419 1.0464 0.6879 5.3718 26.9511 29.7889 1.9409 10.3275 4.0402 1.5455 18.4377 3.2883 6.1033 5.3049 18.4920 12.7249 0.0676 0.0058 11.4383 0.0969 0.0191 2.8910 7.3027 35.1853 0.4863 0.3393 3.2631 21.9307 8.1920 15.6116 1.7111 0.1266 0.4326 1.4008 3.8218 17.7982 6.6009 16.5212 4.4688 11.3152 4.8670
temp: 298.150 k
press: 1.00000 atm
elementType: 6 6 6 1 1 1 6 1 6 1 6 1 6 1 6 1 6 1
symmnumber: 1
zpe: 395398.1 jmol-1
zpe.correction: 0.150599 hartree
zpe.thermalcorrener: 0.156596 hartree
zpe.thermalcorrenthalpy: 0.157540 hartree
zpe.thermalcorrgfe: 0.120881 hartree
zpe.sumelectzpe: -347.869964 hartree
zpe.sumelectthermal: -347.863968 hartree
zpe.sumelectthermalent: -347.863023 hartree
zpe.sumelectthermalfe: -347.899683 hartree
dipole: -0.2940 0.0680 0.0000
dipole: 0.3017
quadrupole: -40.9385 -34.9747 -42.7327
quadrupole: 2.2967 0.0000 -0.0000
quadrupole: -1.3899 4.5739 -3.1841 2.2967 0.0000 -0.0000
hfenergy: -348.0205637 hartree
pointgroup: CS [SG(C3H3),X(C6H6)]
dipole: -0.115695 0.0266056 0. debye
dipolederiv: 0.1713914 -0.174984 -0.0797995 -0.1271553 0.0825075 -0.0909578 -0.0947829 -0.0333321 0.0547782 0.1713914 -0.174984 0.0797995 -0.1271553 0.0825075 0.0909578 0.0947829 0.0333321 0.0547782 0.0362739 0.2189807 0. 0.2359175 -0.2643611 0. 0. 0. 0.0684606 0.1191571 0.0124067 -0.0381576 -0.0248026 0.0755476 0.01177 -0.0302473 0.0313187 0.0792607 0.1191571 0.0124067 0.0381576 -0.0248026 0.0755476 -0.01177 0.0302473 -0.0313187 0.0792607 0.0496685 -0.0093206 0. 0.0202405 0.0874636 0. 0. 0. 0.1372556 -0.0810583 0.0850444 0. 0.1634297 0.22209 0. 0. 0. -0.0718498 0.122871 -0.0034317 0. -0.0015273 0.1088112 0. 0. 0. 0.0936739 -0.4001752 -0.1290439 0. -0.1344047 0.1051626 0. 0. 0. 0.1491193 0.0695274 0.0286647 0. 0.0033104 0.0500187 0. 0. 0. 0.1291611 0.2264963 0.0022557 0.0888139 0.0443419 -0.0606024 0.1110641 -0.1446345 0.0686144 0.134338 0.122793 -0.0159762 -0.0213766 -0.0085552 0.0974964 0.0264847 -0.0602305 -0.0055911 0.0653873 -0.0903923 0.0975048 0.0018841 -0.0366874 0.0363999 0.0279379 -0.0815799 0.0192735 -0.218522 0.0520008 -0.0166538 -0.016588 0.0093755 0.1140585 0.0095185 0.0439901 0.0091901 0.1318474 0.2264963 0.0022558 -0.0888139 0.0443419 -0.0606024 -0.1110641 0.1446345 -0.0686144 0.134338 0.122793 -0.0159762 0.0213766 -0.0085552 0.0974964 -0.0264847 0.0602305 0.0055911 0.0653873 -0.0903923 0.0975048 -0.0018841 -0.0366874 0.0363999 -0.0279379 0.0815799 -0.0192735 -0.218522 0.0520008 -0.0166538 0.016588 0.0093755 0.1140585 -0.0095185 -0.0439901 -0.0091901 0.1318474 unknown
polarizability: 76.3027419|3.4914792|87.0155963|0.|0.|74.9530803 unknown
InChI: InChI=1/9C.9H
charge 1 multiplicity 1
18 atoms
C  0.05632724 -1.30293194 0.76255354
C  0.05632724 -1.30293194 -0.76255354
C  -1.30896424 -0.80734048 0.0000
H  -0.06388638 -2.27802732 1.22297466
H  -0.06388638 -2.27802732 -1.22297466
H  -2.11948164 -1.52625363 0.0000
C  -1.5262998 0.55523964 0.0000
H  -2.53166582 0.96353973 0.0000
C  -0.38840679 1.43132128 0.0000
H  -0.57345232 2.50166363 0.0000
C  0.77221 0.99712368 0.9318739
H  1.39801806 1.7949928 1.31397838
C  0.773675 -0.27803836 1.44061651
H  1.33801638 -0.51863396 2.33562359
C  0.77221 0.99712368 -0.9318739
H  1.39801806 1.7949928 -1.31397838
C  0.773675 -0.27803836 -1.44061651
H  1.33801638 -0.51863396 -2.33562359
