program: Gaussian 16
title: Title Card Required
version: ES64L-G16RevA.03
frameworkgroup: C3H[SGH(C3H3),X(C6H6)]
method: RO3LYP
basis: 6-31G(d)
operation: Freq
keyword: #N
keyword: Geom=AllCheck
keyword: Guess=TCheck
keyword: SCRF=Check
keyword: GenChk
keyword: RO3LYP/6-31G(d)
keyword: Freq
converged: YES YES YES YES
title: Mulliken charges:
elementType: C H C C H H C H C C H H C H C C H H
charge: 0.080755 0.241182 -0.245618 -0.245618 0.251316 0.251316 0.080755 0.241182 -0.245618 -0.245618 0.251316 0.251316 0.080755 0.241182 -0.245618 -0.245618 0.251316 0.251316
chargesum: 1.00000
title: Mulliken charges with hydrogens summed into heavy atoms:
elementType: C C C C C C C C C
charge: 0.321937 0.005698 0.005698 0.321937 0.005698 0.005698 0.321937 0.005698 0.005698
1716.lowfreq: -4.2016 -4.2016 -0.0087 -0.0086 -0.0014 10.0784 377.8670 407.2093 407.2093
frequency: 377.8670 407.2090 407.2090 491.3229 491.3229 548.6721 548.6721 575.2256 575.2256 590.9368 659.3250 777.5922 777.5922 819.1056 881.8909 892.9701 936.8891 936.8891 941.2578 941.2578 996.8398 996.8398 1070.8582 1072.1941 1100.7095 1100.7095 1148.1270 1148.1270 1170.6422 1175.3096 1203.1495 1324.7078 1324.7078 1417.9276 1455.6112 1455.6112 1469.4524 1562.6427 1562.6427 3228.9568 3228.9568 3235.5814 3235.5814 3235.9541 3243.3762 3246.3088 3246.3088 3251.3828
redmass: 3.4739 8.4667 8.4667 2.0576 2.0576 6.7875 6.7875 6.1071 6.1071 1.8904 6.3592 1.7359 1.7359 1.7812 2.8968 5.5710 2.7889 2.7889 1.0796 1.0796 1.5345 1.5345 1.2695 1.2301 1.5422 1.5422 1.0902 1.0902 1.4715 1.5437 1.4128 1.2220 1.2220 2.4159 1.9593 1.9593 2.3535 5.1090 5.1090 1.0894 1.0894 1.0935 1.0935 1.0884 1.0924 1.0974 1.0974 1.0996
irintensity: 0.0000 0.0000 0.0000 0.0066 0.0066 0.0000 0.0000 6.1616 6.1615 0.0000 0.0000 33.6949 33.6950 0.0000 0.5880 0.0000 6.0035 6.0036 0.0000 0.0000 21.0205 21.0205 0.0000 0.0000 10.3177 10.3173 0.0000 0.0000 36.6070 0.0000 35.2460 0.0000 0.0000 0.0000 20.3180 20.3182 7.3783 0.0000 0.0000 3.9055 3.9052 0.0000 0.0000 0.0000 23.0290 28.0451 28.0451 0.0000
temp: 298.150 k
press: 1.00000 atm
elementType: 6 1 6 6 1 1 6 1 6 6 1 1 6 1 6 6 1 1
symmnumber: 3
zpe: 397684.5 jmol-1
zpe.correction: 0.151470 hartree
zpe.thermalcorrener: 0.157595 hartree
zpe.thermalcorrenthalpy: 0.158539 hartree
zpe.thermalcorrgfe: 0.122884 hartree
zpe.sumelectzpe: -347.762006 hartree
zpe.sumelectthermal: -347.755882 hartree
zpe.sumelectthermalent: -347.754937 hartree
zpe.sumelectthermalfe: -347.790592 hartree
dipole: 0.0000 -0.0000 0.0000
dipole: 0.0000
quadrupole: -41.8486 -41.8486 -33.8297
quadrupole: 0.0000 0.0000 -0.0000
quadrupole: -2.6729 -2.6729 5.3459 0.0000 0.0000 -0.0000
hfenergy: -347.9134763 hartree
pointgroup: C03H [SGH(C3H3),X(C6H6)]
dipole: 0. 0. 0. debye
dipolederiv: -0.064396 -0.000005 0. 0.0000003 -0.2221555 0. 0. 0. 0.1978689 0.0660665 0.0000068 0. -0.0000003 0.1341606 0. 0. 0. 0.1095883 0.2427908 -0.0000103 0. -0.0000016 -0.0712373 0.1810619 -0.0000029 0.2060635 -0.075052 0.2427908 -0.0000103 0. -0.0000016 -0.0712373 -0.1810619 0.0000029 -0.2060635 -0.075052 0.1471536 0.0000034 -0.0000021 -0.0000005 0.0577917 0.0231937 -0.0000002 -0.0109509 0.0879895 0.1471536 0.0000034 0.0000021 -0.0000005 0.0577917 -0.0231937 0.0000002 0.0109509 0.0879895 -0.1827129 0.0683105 0. 0.0683164 -0.1038387 0. 0. 0. 0.1978689 0.1171369 -0.029485 0. -0.0294863 0.0830902 0. 0. 0. 0.1095883 0.0072743 0.1359807 0.1568044 0.1359809 0.1642791 -0.0905307 0.1784577 -0.1030291 -0.075052 0.0072743 0.1359807 -0.1568044 0.1359809 0.1642791 0.0905307 -0.1784577 0.1030291 -0.075052 0.0801321 0.038696 0.0200876 0.0386935 0.1248132 -0.0115947 -0.0094838 0.0054754 0.0879895 0.0801321 0.038696 -0.0200876 0.0386935 0.1248132 0.0115947 0.0094838 -0.0054754 0.0879895 -0.1827133 -0.0683086 0. -0.068303 -0.1038343 0. 0. 0. 0.1978674 0.1171382 0.0294856 0. 0.0294814 0.0830897 0. 0. 0. 0.1095888 0.0072581 -0.1359816 -0.1568022 -0.1359771 0.1642866 -0.09053 -0.1784609 -0.1030379 -0.0750515 0.0072581 -0.1359816 0.1568022 -0.1359771 0.1642866 0.09053 0.1784609 0.1030379 -0.0750515 0.0801338 -0.0386933 -0.0200847 -0.0386966 0.1248131 -0.0115985 0.009485 0.005476 0.0879903 0.0801338 -0.0386933 0.0200847 -0.0386966 0.1248131 0.0115985 -0.009485 -0.005476 0.0879903 unknown
polarizability: 75.1494022|0.0000051|75.1493963|0.|0.|86.3273622 unknown
InChI: InChI=1/9C.9H
charge 1 multiplicity 1
18 atoms
C  0.00000493 1.63683109 0.0000
H  -0.00000481 2.72215043 0.0000
C  0.0000084 0.92003054 1.20476865
C  0.0000084 0.92003054 -1.20476865
H  -0.0000036 1.4299408 -2.16244164
H  -0.0000036 1.4299408 2.16244164
C  1.4175346 -0.81841939 0.0000
H  2.35745359 -1.36107062 0.0000
C  0.79676538 -0.46002211 1.20476865
C  0.79676538 -0.46002211 -1.20476865
H  1.23836661 -0.71496686 -2.16244164
H  1.23836661 -0.71496686 2.16244164
C  -1.41753953 -0.81841085 0.0000
H  -2.35744877 -1.36107895 0.0000
C  -0.79677377 -0.46000757 1.20476865
C  -0.79677377 -0.46000757 -1.20476865
H  -1.23836301 -0.71497308 -2.16244164
H  -1.23836301 -0.71497308 2.16244164
