program: Gaussian 16
title: Title Card Required
version: ES64L-G16RevA.03
frameworkgroup: CS[SG(C3H3),X(C6H6)]
method: RSOGGA11X
basis: 6-31G(d)
operation: Freq
keyword: #N
keyword: Geom=AllCheck
keyword: Guess=TCheck
keyword: SCRF=Check
keyword: GenChk
keyword: RSOGGA11X/6-31G(d)Freq
converged: YES YES YES YES
title: Mulliken charges:
elementType: C C C H H H C H C H C H C H C H C H
charge: -0.250959 -0.250959 -0.297735 0.287122 0.287122 0.290058 0.064396 0.293298 -0.328918 0.286462 -0.239882 0.284561 -0.015456 0.280833 -0.239882 0.284561 -0.015456 0.280833
chargesum: 1.00000
title: Mulliken charges with hydrogens summed into heavy atoms:
elementType: C C C C C C C C C
charge: 0.036163 0.036163 -0.007677 0.357694 -0.042456 0.044679 0.265377 0.044679 0.265377
1716.lowfreq: -330.0824 -8.1041 0.0003 0.0005 0.0008 2.6651 2.7916 289.0140 415.7913
frequency: -330.0823 289.0137 415.7913 479.6011 488.7290 507.0954 529.0739 605.6748 637.0027 680.2368 729.0878 763.9638 817.4284 853.5230 908.4177 923.7905 941.8442 944.6467 963.8414 991.5415 1016.5424 1030.1515 1087.5458 1098.7533 1113.2117 1144.7101 1172.6562 1179.9616 1199.3113 1202.8589 1280.3174 1344.5355 1356.7705 1450.2549 1468.1639 1482.4535 1545.4853 1625.9193 1639.9480 3254.0279 3273.0348 3277.8739 3280.9816 3285.7712 3288.5422 3302.2168 3303.1296 3305.0921
redmass: 6.7509 4.3169 4.6678 2.3279 2.3847 5.3058 6.7317 5.4083 2.3213 5.3423 2.9449 1.5671 1.6437 1.9334 2.4997 2.0227 2.2512 1.9494 1.5529 1.6445 1.2835 1.8499 1.7720 1.4949 1.2864 1.2713 1.1541 1.0980 1.1731 1.3171 2.0650 1.2375 1.2549 2.4624 1.8758 1.9327 2.7715 5.0355 5.7025 1.0913 1.0904 1.0906 1.0916 1.0909 1.0927 1.0997 1.0966 1.0987
irintensity: 24.6009 0.3953 0.7137 1.1638 0.8013 1.2476 4.4229 5.8965 1.5157 1.7891 14.0727 37.9553 29.2964 4.0075 8.9113 6.1167 2.6750 24.0845 3.5778 12.1959 0.9698 18.8050 12.6103 0.2210 0.0000 13.3278 0.8561 0.0164 2.5835 4.7496 39.0743 0.6560 0.9002 6.3074 31.5392 8.8312 17.8088 3.9654 0.1347 0.5462 0.7823 8.2990 7.1986 15.8592 13.8195 6.6732 15.1251 2.9032
temp: 298.150 k
press: 1.00000 atm
elementType: 6 6 6 1 1 1 6 1 6 1 6 1 6 1 6 1 6 1
symmnumber: 1
zpe: 403623.2 jmol-1
zpe.correction: 0.153732 hartree
zpe.thermalcorrener: 0.159499 hartree
zpe.thermalcorrenthalpy: 0.160443 hartree
zpe.thermalcorrgfe: 0.124183 hartree
zpe.sumelectzpe: -347.781797 hartree
zpe.sumelectthermal: -347.776030 hartree
zpe.sumelectthermalent: -347.775086 hartree
zpe.sumelectthermalfe: -347.811345 hartree
dipole: -0.4678 0.0943 0.0000
dipole: 0.4772
quadrupole: -40.9515 -34.8434 -43.4199
quadrupole: 2.3435 -0.0000 -0.0000
quadrupole: -1.2133 4.8949 -3.6816 2.3435 -0.0000 -0.0000
hfenergy: -347.9355285 hartree
pointgroup: CS [SG(C3H3),X(C6H6)]
dipole: -0.1844314 0.0351268 0. debye
dipolederiv: 0.2292559 -0.1909299 -0.0630915 -0.1315803 0.0970793 -0.0915692 -0.0893614 -0.0089469 0.0615129 0.2292559 -0.1909299 0.0630915 -0.1315803 0.0970793 0.0915692 0.0893614 0.0089469 0.0615129 -0.0407586 0.2703358 0. 0.3306276 -0.3302087 0. 0. 0. 0.0234382 0.125465 0.0124802 -0.0371711 -0.0265914 0.0817355 0.0113085 -0.0339112 0.030092 0.0866032 0.1254651 0.0124802 0.0371711 -0.0265915 0.0817355 -0.0113085 0.0339112 -0.030092 0.0866032 0.0563479 -0.00622 0. 0.0178668 0.0926244 0. 0. 0. 0.1459486 -0.0355064 0.0760241 0. 0.1535924 0.2811505 0. 0. 0. -0.0727348 0.1258273 -0.0025844 0. -0.002501 0.1116959 0. 0. 0. 0.108608 -0.5245283 -0.1381894 0. -0.1418923 0.1096093 0. 0. 0. 0.1078167 0.0769875 0.0261755 0. 0.0039215 0.0565024 0. 0. 0. 0.1367784 0.259882 0.0095847 0.1257107 0.0564807 -0.0582928 0.1096604 -0.1910331 0.0315833 0.1519198 0.1302841 -0.0177811 -0.0258127 -0.0071909 0.1036786 0.0277683 -0.0658744 -0.0008751 0.0731341 -0.1237817 0.0937987 0.027009 -0.0795798 -0.0008806 0.0222937 -0.0811782 0.0232429 -0.2414464 0.04971 -0.0199234 -0.030734 0.0076543 0.1159931 0.0124893 0.0486109 0.0121015 0.1433489 0.259882 0.0095847 -0.1257107 0.0564806 -0.0582928 -0.1096604 0.1910331 -0.0315833 0.1519198 0.1302841 -0.0177811 0.0258127 -0.0071909 0.1036786 -0.0277683 0.0658743 0.0008751 0.0731341 -0.1237817 0.0937987 -0.027009 -0.0795798 -0.0008806 -0.0222937 0.0811782 -0.0232429 -0.2414464 0.04971 -0.0199234 0.030734 0.0076543 0.1159931 -0.0124893 -0.048611 -0.0121015 0.1433489 unknown
polarizability: 75.7652577|3.0863502|86.5065548|0.|0.|74.131358 unknown
InChI: InChI=1/9C.9H
charge 1 multiplicity 1
18 atoms
C  0.05267232 -1.29945034 0.75719817
C  0.05267232 -1.29945034 -0.75719817
C  -1.30384281 -0.81017545 0.0000
H  -0.07293819 -2.27399852 1.21798851
H  -0.07293819 -2.27399852 -1.21798851
H  -2.1184654 -1.52462644 0.0000
C  -1.51821688 0.55144094 0.0000
H  -2.52344735 0.96081464 0.0000
C  -0.37844534 1.42855734 0.0000
H  -0.56988544 2.49803971 0.0000
C  0.75870431 1.00003207 0.95016973
H  1.39012981 1.79695725 1.32571518
C  0.77225701 -0.27484947 1.44164841
H  1.35555135 -0.52714637 2.32100952
C  0.75870431 1.00003207 -0.95016973
H  1.39012981 1.79695725 -1.32571518
C  0.77225701 -0.27484947 -1.44164841
H  1.35555135 -0.52714637 -2.32100952
