program: Gaussian 16
title: Title Card Required
version: ES64L-G16RevA.03
frameworkgroup: C3H[SGH(C3H3),X(C6H6)]
method: RHSEH1PBE
basis: 6-31G(d)
operation: Freq
keyword: #N
keyword: Geom=AllCheck
keyword: Guess=TCheck
keyword: SCRF=Check
keyword: GenChk
keyword: RHSEH1PBE/6-31G(d)Freq
converged: YES YES YES YES
title: Mulliken charges:
elementType: C H C C H H C H C C H H C H C C H H
charge: 0.053462 0.264735 -0.264525 -0.264525 0.272093 0.272093 0.053462 0.264735 -0.264525 -0.264525 0.272093 0.272093 0.053462 0.264735 -0.264525 -0.264525 0.272093 0.272093
chargesum: 1.00000
title: Mulliken charges with hydrogens summed into heavy atoms:
elementType: C C C C C C C C C
charge: 0.318197 0.007568 0.007568 0.318197 0.007568 0.007568 0.318197 0.007568 0.007568
chargesum: 1.00001
1716.lowfreq: -0.0033 -0.0033 -0.0015 5.4350 5.4350 9.4974 381.3909 406.1756 406.1756
frequency: 381.3909 406.1753 406.1753 496.3121 496.3121 554.0049 554.0049 583.0752 583.0752 600.7919 666.4144 790.0069 790.0069 836.7125 893.5387 907.6183 948.9233 948.9233 951.5811 951.5811 1010.9139 1010.9139 1082.0630 1084.5204 1111.2163 1111.2163 1155.0674 1155.0674 1175.7649 1187.4133 1209.8451 1334.6765 1334.6765 1437.8182 1470.8334 1470.8334 1486.3515 1587.7939 1587.7939 3247.5803 3247.5803 3254.0731 3254.1598 3254.1598 3261.3488 3264.0172 3264.0172 3268.9118
redmass: 3.4692 8.4904 8.4904 2.0258 2.0258 6.7933 6.7933 6.4865 6.4865 1.9243 6.3235 1.7122 1.7122 1.7359 2.8731 5.5350 1.0782 1.0782 2.8682 2.8682 1.5098 1.5098 1.2701 1.2385 1.5245 1.5245 1.0860 1.0860 1.4760 1.4830 1.3981 1.2230 1.2230 2.5919 2.0141 2.0141 2.3987 5.2071 5.2071 1.0894 1.0894 1.0886 1.0937 1.0937 1.0926 1.0978 1.0978 1.0999
irintensity: 0.0000 0.0000 0.0000 0.0086 0.0086 0.0000 0.0000 7.4316 7.4314 0.0000 0.0000 37.5281 37.5288 0.0000 0.5195 0.0000 0.0000 0.0000 8.5411 8.5407 20.9611 20.9611 0.0000 0.0000 10.2862 10.2862 0.0000 0.0000 41.1608 0.0000 37.9782 0.0000 0.0000 0.0000 24.0558 24.0561 7.4989 0.0000 0.0000 4.4195 4.4195 0.0000 0.0000 0.0000 26.4906 29.3580 29.3568 0.0000
temp: 298.150 k
press: 1.00000 atm
elementType: 6 1 6 6 1 1 6 1 6 6 1 1 6 1 6 6 1 1
symmnumber: 3
zpe: 401151.2 jmol-1
zpe.correction: 0.152790 hartree
zpe.thermalcorrener: 0.158841 hartree
zpe.thermalcorrenthalpy: 0.159785 hartree
zpe.thermalcorrgfe: 0.124241 hartree
zpe.sumelectzpe: -347.492940 hartree
zpe.sumelectthermal: -347.486890 hartree
zpe.sumelectthermalent: -347.485945 hartree
zpe.sumelectthermalfe: -347.521490 hartree
dipole: 0.0000 0.0000 0.0000
dipole: 0.0000
quadrupole: -41.9776 -41.9776 -33.7522
quadrupole: 0.0000 -0.0000 -0.0000
quadrupole: -2.7418 -2.7418 5.4836 0.0000 -0.0000 -0.0000
hfenergy: -347.6457308 hartree
pointgroup: C03H [SGH(C3H3),X(C6H6)]
dipole: 0. 0. 0. debye
dipolederiv: -0.0749025 -0.0000168 0. -0.0000169 -0.2314375 0. 0. 0. 0.2030904 0.0671056 0.0000094 0. -0.000006 0.1376915 0. 0. 0. 0.1139232 0.2559689 0.0000012 0.0000087 -0.0000063 -0.0870673 0.1919994 -0.0000188 0.2243793 -0.0845363 0.2559689 0.0000012 -0.0000087 -0.0000063 -0.0870673 -0.1919994 0.0000188 -0.2243794 -0.0845363 0.153103 0.0000034 -0.0000043 -0.0000052 0.0621053 0.0224796 0.0000043 -0.0111326 0.0926979 0.153103 0.0000034 0.0000043 -0.0000052 0.0621053 -0.0224796 -0.0000043 0.0111326 0.0926979 -0.1923007 0.0677804 0. 0.0677864 -0.1140393 0. 0. 0. 0.2030904 0.1200453 -0.030564 0. -0.0305649 0.0847519 0. 0. 0. 0.1139232 -0.0013036 0.1485418 0.1662757 0.1485417 0.1702051 -0.0960007 0.1943196 -0.1121873 -0.0845363 -0.0013036 0.1485418 -0.1662757 0.1485417 0.1702051 0.0960007 -0.1943196 0.1121873 -0.0845363 0.0848547 0.0394043 0.019469 0.0394019 0.1303536 -0.0112379 -0.0096411 0.0055663 0.0926979 0.0848547 0.0394043 -0.019469 0.0394019 0.1303536 0.0112379 0.0096411 -0.0055663 0.0926979 -0.1923176 -0.0677835 0. -0.0677805 -0.1140262 0. 0. 0. 0.2030905 0.1200527 0.0305739 0. 0.0305658 0.084752 0. 0. 0. 0.1139207 -0.0013164 -0.1485334 -0.1662795 -0.1485372 0.1702065 -0.0959958 -0.1943148 -0.1122001 -0.0845474 -0.0013164 -0.1485334 0.1662795 -0.1485372 0.1702065 0.0959958 0.1943148 0.1122001 -0.0845474 0.0848559 -0.0393992 -0.0194622 -0.0394047 0.1303543 -0.0112402 0.0096464 0.0055719 0.0927076 0.0848559 -0.0393992 0.0194622 -0.0394047 0.1303543 0.0112402 -0.0096464 -0.0055719 0.0927076 unknown
polarizability: 75.0949474|0.0003632|75.0945282|0.|0.|85.9584862 unknown
InChI: InChI=1/9C.9H
charge 1 multiplicity 1
18 atoms
C  0.00000363 1.63210102 0.0000
H  -0.00000693 2.71699774 0.0000
C  0.00000789 0.91771143 1.20147362
C  0.00000789 0.91771143 -1.20147362
H  -0.00000048 1.42659783 -2.15925969
H  -0.00000048 1.42659783 2.15925969
C  1.41343888 -0.81605322 0.0000
H  2.35299228 -1.35849244 0.0000
C  0.79475722 -0.45886212 1.20147362
C  0.79475722 -0.45886212 -1.20147362
H  1.23546995 -0.71329807 -2.15925969
H  1.23546995 -0.71329807 2.15925969
C  -1.41344251 -0.81604694 0.0000
H  -2.35298535 -1.35850444 0.0000
C  -0.79476511 -0.45884845 1.20147362
C  -0.79476511 -0.45884845 -1.20147362
H  -1.23546947 -0.7132989 -2.15925969
H  -1.23546947 -0.7132989 2.15925969
