program: Gaussian 16
title: Title Card Required
version: ES64L-G16RevA.03
frameworkgroup: CS[SG(C3H3),X(C6H6)]
method: RwB97X
basis: 6-31G(d)
operation: Freq
keyword: #N
keyword: Geom=AllCheck
keyword: Guess=TCheck
keyword: SCRF=Check
keyword: GenChk
keyword: RwB97X/6-31G(d)
keyword: Freq
converged: YES YES NO YES
title: Mulliken charges:
elementType: C C C H H H C H C H C H C H C H C H
charge: -0.171567 -0.171567 -0.273799 0.268702 0.268702 0.274701 0.082537 0.283380 -0.358260 0.247337 -0.134578 0.248029 -0.086354 0.247820 -0.134578 0.248029 -0.086354 0.247820
chargesum: 1.00000
title: Mulliken charges with hydrogens summed into heavy atoms:
elementType: C C C C C C C C C
charge: 0.097135 0.097135 0.000901 0.365918 -0.110923 0.113451 0.161466 0.113451 0.161466
1716.lowfreq: -9.1356 -1.7119 -0.0007 0.0005 0.0008 13.0910 284.0171 303.2264 340.2005
frequency: 284.0167 303.2263 340.2005 412.2387 455.6978 544.5077 553.9762 567.4155 617.9263 684.4086 761.3137 783.1623 804.5776 873.3576 889.6353 912.4577 943.7259 945.8781 987.5822 992.5923 1030.9078 1057.1045 1057.7000 1080.1254 1140.8445 1172.7288 1189.9055 1195.9188 1215.5478 1276.9309 1347.6658 1352.6062 1365.4471 1428.8542 1451.6717 1457.7874 1600.9816 1738.1711 1738.5157 3203.3552 3235.0656 3242.4745 3254.0299 3259.3948 3260.4236 3282.6457 3283.6298 3292.8273
redmass: 3.4800 3.1303 3.1037 3.2440 3.1755 3.9688 5.0066 5.7114 2.7631 3.3927 1.5793 1.6339 2.0930 3.0847 2.4151 2.1014 2.7019 2.5436 1.4374 1.3657 1.7964 2.0118 1.7789 1.4019 1.2254 1.1978 1.0744 1.1263 1.1678 1.3707 1.2603 1.3899 1.4955 1.6928 3.0936 1.7421 3.8777 6.2795 6.7086 1.0900 1.0906 1.0924 1.0929 1.0891 1.0900 1.1014 1.1011 1.0982
irintensity: 16.1546 4.7083 15.2363 0.0019 3.9579 15.6068 11.0736 9.7959 0.4582 9.4860 49.5863 90.1306 1.4264 1.0702 1.2206 9.1177 14.1004 37.6711 6.3549 1.1440 8.2421 14.8033 1.0267 1.5602 0.0604 13.9768 0.5209 0.8211 0.2869 12.5578 1.9163 8.5570 33.9847 27.8602 11.2016 0.2877 30.7708 11.1939 1.8831 0.4767 0.6304 2.1298 7.1399 7.5502 8.1377 2.0709 5.5794 7.3505
temp: 298.150 k
press: 1.00000 atm
elementType: 6 6 6 1 1 1 6 1 6 1 6 1 6 1 6 1 6 1
symmnumber: 1
zpe: 405959.7 jmol-1
zpe.correction: 0.154622 hartree
zpe.thermalcorrener: 0.160928 hartree
zpe.thermalcorrenthalpy: 0.161872 hartree
zpe.thermalcorrgfe: 0.124670 hartree
zpe.sumelectzpe: -347.780650 hartree
zpe.sumelectthermal: -347.774345 hartree
zpe.sumelectthermalent: -347.773400 hartree
zpe.sumelectthermalfe: -347.810602 hartree
dipole: -1.5317 -0.3225 0.0000
dipole: 1.5653
quadrupole: -40.7016 -34.5890 -43.1628
quadrupole: 1.5441 -0.0000 -0.0000
quadrupole: -1.2171 4.8955 -3.6784 1.5441 -0.0000 -0.0000
hfenergy: -347.9352721 hartree
pointgroup: CS [SG(C3H3),X(C6H6)]
dipole: -0.6020536 -0.1295832 0. debye
dipolederiv: 0.4356756 -0.2361006 0.2128176 -0.0983329 0.2315076 -0.0535414 -0.053621 0.1304571 0.2100736 0.4356757 -0.2361006 -0.2128176 -0.0983329 0.2315075 0.0535414 0.053621 -0.1304571 0.2100736 -0.3163759 0.4179107 0. 0.5247571 -0.6010355 0. 0. 0. -0.3616968 0.0712102 0.0296896 -0.0326989 -0.0304029 0.0699327 0.0085447 -0.0267686 0.0190856 0.0841887 0.0712102 0.0296896 0.0326989 -0.0304028 0.0699327 -0.0085447 0.0267686 -0.0190856 0.0841887 0.0632325 0.0074746 0. 0.0268659 0.0924096 0. 0. 0. 0.1431033 0.1869299 0.0961923 0. -0.0693802 0.5475068 0. 0. 0. 0.0272536 0.1089443 -0.0040893 0. -0.0074289 0.1196984 0. 0. 0. 0.184924 -0.4342159 -0.2624551 0. -0.0315701 0.221283 0. 0. 0. -0.1823265 0.0676403 0.0193503 0. 0.0089644 0.0088415 0. 0. 0. 0.0829561 0.1234967 0.1094421 0.2435494 -0.0575546 -0.0337875 -0.0920794 0.0906222 -0.1030859 0.230929 0.12009 -0.0305496 -0.0448407 -0.0014725 0.0971231 0.0230431 -0.0737123 -0.0106998 0.069647 -0.1663427 0.0162405 0.0747877 -0.0226011 -0.1646793 0.0472616 -0.0109523 0.0369444 -0.1724485 0.0777925 -0.0259138 -0.0646448 -0.0157401 0.1055516 0.0125088 -0.0037892 0.0274599 0.1305033 0.1234967 0.1094421 -0.2435494 -0.0575547 -0.0337875 0.0920794 -0.0906222 0.1030859 0.230929 0.1200901 -0.0305496 0.0448407 -0.0014725 0.0971231 -0.0230431 0.0737123 0.0106998 0.069647 -0.1663427 0.0162405 -0.0747877 -0.0226011 -0.1646793 -0.0472617 0.0109523 -0.0369444 -0.1724485 0.0777925 -0.0259138 0.0646448 -0.0157401 0.1055516 -0.0125088 0.0037892 -0.0274599 0.1305033 unknown
polarizability: 67.7474487|2.7876966|89.4443585|0.|0.|68.510349 unknown
InChI: InChI=1/9C.9H
charge 1 multiplicity 1
18 atoms
C  -0.02422523 -1.30660061 0.7304031
C  -0.02422523 -1.30660061 -0.7304031
C  -1.35794062 -0.71102103 0.0000
H  -0.27225022 -2.25141855 1.20852645
H  -0.27225022 -2.25141855 -1.20852645
H  -2.24245302 -1.33628483 0.0000
C  -1.40590568 0.65161401 0.0000
H  -2.35895812 1.17655602 0.0000
C  -0.13954733 1.41764859 0.0000
H  -0.30599884 2.49453672 0.0000
C  0.73993324 0.9645925 1.17540534
H  1.36096688 1.71443287 1.65426709
C  0.74568797 -0.32442377 1.50922601
H  1.33756867 -0.70129219 2.33781863
C  0.73993324 0.9645925 -1.17540534
H  1.36096688 1.71443287 -1.65426709
C  0.74568797 -0.32442377 -1.50922601
H  1.33756867 -0.70129219 -2.33781863
