program: Gaussian 16
title: Title Card Required
version: ES64L-G16RevA.03
frameworkgroup: C2V[C2(CH),SGV(C4H4),X(C4H4)]
method: RPBEPBE
basis: 6-31G(d)
operation: Freq
keyword: #N
keyword: Geom=AllCheck
keyword: Guess=TCheck
keyword: SCRF=Check
keyword: GenChk
keyword: RPBEPBE/6-31G(d)
keyword: Freq
converged: YES YES YES YES
title: Mulliken charges:
elementType: C C C C H H C H C H H H C H C H C H
charge: -0.091684 -0.324841 -0.324841 -0.091684 0.232869 0.232869 -0.000178 0.247010 -0.000178 0.247010 0.227149 0.227149 -0.091684 0.232869 -0.091684 0.232869 -0.094330 0.231314
chargesum: 1.00000
title: Mulliken charges with hydrogens summed into heavy atoms:
elementType: C C C C C C C C C
charge: 0.141184 -0.097692 -0.097692 0.141184 0.246832 0.246832 0.141184 0.141184 0.136984
1716.lowfreq: -312.2009 -9.7347 -0.0007 0.0002 0.0006 0.8663 3.5106 262.7955 294.9739
frequency: -312.2009 262.7954 294.9739 367.0950 376.1579 388.9441 397.2984 498.5963 574.6535 657.9137 699.1813 748.2439 791.2361 804.9432 857.8411 860.5739 866.6696 880.3008 891.7859 898.4696 938.3314 1000.1206 1010.7334 1019.2063 1109.1679 1123.7349 1178.8713 1214.9901 1219.8425 1224.0807 1236.2327 1263.8528 1312.3711 1314.4514 1398.3909 1510.3962 1535.0060 1651.8968 1686.1689 3086.1391 3086.9804 3115.8378 3119.2751 3152.6279 3155.9862 3157.3594 3175.3274 3178.2703
redmass: 2.1484 1.9860 3.5738 2.9390 7.3280 1.7404 3.1745 6.1449 6.7206 1.2376 1.5003 2.3288 5.0510 2.6707 1.5850 1.8941 2.0158 3.8074 2.6330 4.8112 2.9078 2.5775 1.5288 1.5749 1.0157 1.1533 1.3172 1.3790 1.2546 1.0822 1.3117 1.2241 1.4836 1.3363 1.4989 2.6418 4.2363 6.0639 6.9819 1.0872 1.0878 1.0896 1.0915 1.0943 1.0843 1.0857 1.1046 1.1064
irintensity: 0.0000 0.0001 0.3390 0.5997 0.1658 39.1385 0.0000 3.0755 0.0000 5.1001 91.8541 53.7377 2.7439 1.4225 0.0000 2.1079 5.4913 4.1010 0.0000 9.9789 6.0380 0.9078 0.4994 0.0000 0.1301 13.7561 9.2351 61.1426 0.0000 0.8730 13.0884 0.0000 40.0795 0.0051 11.9190 4.3125 75.5071 12.4006 23.6660 2.5151 0.6139 0.0589 0.3692 1.3006 0.0000 15.1916 23.9130 15.5502
temp: 298.150 k
press: 1.00000 atm
elementType: 6 6 6 6 1 1 6 1 6 1 1 1 6 1 6 1 6 1
symmnumber: 2
zpe: 384559.5 jmol-1
zpe.correction: 0.146471 hartree
zpe.thermalcorrener: 0.153093 hartree
zpe.thermalcorrenthalpy: 0.154037 hartree
zpe.thermalcorrgfe: 0.116887 hartree
zpe.sumelectzpe: -347.436089 hartree
zpe.sumelectthermal: -347.429467 hartree
zpe.sumelectthermalent: -347.428523 hartree
zpe.sumelectthermalfe: -347.465672 hartree
dipole: -0.0000 0.0000 1.6741
dipole: 1.6741
quadrupole: -43.8208 -33.1717 -39.6786
quadrupole: -0.0000 -0.0000 0.0000
quadrupole: -4.9305 5.7187 -0.7882 -0.0000 -0.0000 0.0000
hfenergy: -347.5825599 hartree
pointgroup: C02V [C2(C1H1),SGV(C4H4),X(C4H4)]
dipole: 0. 0. 0.6586425 debye
dipolederiv: 0.1343028 -0.0155058 -0.1390534 -0.2885994 -0.1131703 0.3301416 -0.1169535 0.0114524 -0.0692037 -0.1937109 0. 0. 0. 0.2808656 -0.2742948 0. 0.0504584 -0.3192787 -0.1937109 0. 0. 0. 0.2808656 0.2742948 0. -0.0504584 -0.3192786 0.1343028 0.0155059 -0.1390534 0.2885994 -0.1131703 -0.3301416 -0.1169535 -0.0114524 -0.0692037 0.0839191 -0.0144786 0.0421803 0.0418651 0.1172454 -0.0591045 0.0254842 -0.0058271 0.1394517 0.0839191 0.0144786 0.0421803 -0.0418651 0.1172454 0.0591045 0.0254842 0.0058271 0.1394517 0.0419437 0. 0. 0. 0.4887816 0.0056517 0. -0.2314013 0.5041765 0.163217 0. 0. 0. 0.0801123 -0.0120672 0. -0.0296455 0.0545363 0.0419437 0. 0. 0. 0.4887816 -0.0056517 0. 0.2314013 0.5041765 0.163217 0. 0. 0. 0.0801123 0.0120672 0. 0.0296455 0.0545363 0.056184 0. 0. 0. -0.002527 -0.0131566 0. -0.0091879 0.063015 0.056184 0. 0. 0. -0.002527 0.0131566 0. 0.0091879 0.063015 0.1343028 -0.0155059 0.1390534 -0.2885994 -0.1131703 -0.3301416 0.1169535 -0.0114524 -0.0692037 0.0839191 -0.0144786 -0.0421803 0.0418651 0.1172454 0.0591045 -0.0254842 0.0058271 0.1394517 0.1343028 0.0155058 0.1390534 0.2885994 -0.1131703 0.3301416 0.1169535 0.0114524 -0.0692037 0.0839191 0.0144786 -0.0421803 -0.0418651 0.1172454 -0.0591045 -0.0254842 -0.0058271 0.1394517 -0.1611444 0. 0. 0. -0.7922882 0. 0. 0. 0.0702446 0.1529889 0. 0. 0. 0.0815226 0. 0. 0. 0.0438652 unknown
polarizability: 65.0813033|0.|96.9946908|0.|0.|79.1200246 unknown
InChI: InChI=1/9C.9H
charge 1 multiplicity 1
18 atoms
C  1.24412315 0.66359959 -0.89243168
C  0.0000 1.3908074 -0.31073335
C  0.0000 -1.3908074 -0.31073335
C  1.24412315 -0.66359959 -0.89243168
H  2.04584357 1.29473102 -1.28409744
H  2.04584357 -1.29473102 -1.28409744
C  0.0000 1.22757974 1.16151285
H  0.0000 2.13677195 1.77714291
C  0.0000 -1.22757974 1.16151285
H  0.0000 -2.13677195 1.77714291
H  0.0000 -2.45462713 -0.58307073
H  0.0000 2.45462713 -0.58307073
C  -1.24412315 -0.66359959 -0.89243168
H  -2.04584357 -1.29473102 -1.28409744
C  -1.24412315 0.66359959 -0.89243168
H  -2.04584357 1.29473102 -1.28409744
C  0.0000 0.0000 1.83050107
H  0.0000 0.0000 2.92445204
