program: Gaussian 16
title: Title Card Required
version: ES64L-G16RevA.03
frameworkgroup: CS[SG(C3H3),X(C6H6)]
method: RPBEPBE
basis: 6-31G(d)
operation: Freq
keyword: #N
keyword: Geom=AllCheck
keyword: Guess=TCheck
keyword: SCRF=Check
keyword: GenChk
keyword: RPBEPBE/6-31G(d)
keyword: Freq
converged: YES YES YES YES
title: Mulliken charges:
elementType: C C C H H H C H C H C H C H C H C H
charge: -0.204266 -0.204266 -0.237812 0.246963 0.246963 0.251591 0.092152 0.246302 -0.312398 0.239974 -0.172428 0.241709 0.014497 0.233621 -0.172428 0.241709 0.014497 0.233621
chargesum: 1.00000
title: Mulliken charges with hydrogens summed into heavy atoms:
elementType: C C C C C C C C C
charge: 0.042697 0.042697 0.013779 0.338454 -0.072424 0.069281 0.248118 0.069281 0.248118
1716.lowfreq: -210.2123 0.0006 0.0008 0.0009 5.9927 10.8039 12.9067 271.9124 388.0404
frequency: -210.2122 271.9122 388.0402 450.7241 457.7516 477.9027 509.4464 581.4397 600.9411 653.3210 707.8698 716.7696 758.2323 821.2482 857.3449 880.0076 882.3435 892.6393 901.0925 922.1336 953.5645 981.9408 1036.0134 1043.6909 1060.5072 1113.7614 1127.8908 1136.6294 1146.2551 1160.4006 1246.9780 1279.3454 1292.7737 1366.2832 1392.8291 1409.0544 1489.9427 1559.3743 1576.4710 3121.6534 3142.5793 3147.8152 3156.2732 3158.4025 3164.3878 3177.7657 3179.0912 3181.3716
redmass: 6.0610 4.2115 4.7620 2.2521 2.6009 4.8556 5.9001 4.8583 2.3369 4.3893 2.3359 1.6044 1.6518 2.3067 2.0506 1.8041 1.8885 1.9508 2.4518 1.8892 1.2507 1.9025 1.8348 1.3767 1.4102 1.2162 1.1576 1.1107 1.2070 1.2215 2.0003 1.2428 1.2709 2.4298 1.8254 1.8919 3.1610 5.4477 6.1721 1.0902 1.0898 1.0898 1.0897 1.0915 1.0898 1.0985 1.0964 1.0985
irintensity: 17.6851 2.1565 2.3306 1.7962 1.3467 0.0240 3.3470 1.3445 2.7451 1.0762 28.9187 38.4888 12.2168 7.1518 10.4341 4.1318 20.2358 4.8598 5.2933 12.8257 0.6760 15.1291 6.6030 0.0054 0.0054 9.1465 1.8900 1.2267 2.0921 1.6873 36.8567 0.9804 1.6361 4.9329 21.8550 3.9468 11.7869 4.6557 0.0005 0.1145 0.2083 2.7062 19.9721 15.0768 11.4455 5.8229 17.4987 1.6977
temp: 298.150 k
press: 1.00000 atm
elementType: 6 6 6 1 1 1 6 1 6 1 6 1 6 1 6 1 6 1
symmnumber: 1
zpe: 386000.3 jmol-1
zpe.correction: 0.147020 hartree
zpe.thermalcorrener: 0.153146 hartree
zpe.thermalcorrenthalpy: 0.154090 hartree
zpe.thermalcorrgfe: 0.117272 hartree
zpe.sumelectzpe: -347.449308 hartree
zpe.sumelectthermal: -347.443181 hartree
zpe.sumelectthermalent: -347.442237 hartree
zpe.sumelectthermalfe: -347.479056 hartree
dipole: -0.4966 -0.0165 -0.0000
dipole: 0.4969
quadrupole: -40.5540 -34.4940 -42.6062
quadrupole: 2.3572 -0.0000 0.0000
quadrupole: -1.3359 4.7241 -3.3881 2.3572 -0.0000 0.0000
hfenergy: -347.5963277 hartree
pointgroup: CS [SG(C3H3),X(C6H6)]
dipole: -0.1951464 -0.0113726 0. debye
dipolederiv: 0.2050068 -0.1545317 0.0337483 -0.0960593 0.0976261 -0.0561477 -0.0604146 0.0049056 0.093388 0.2050068 -0.1545317 -0.0337483 -0.0960593 0.0976261 0.0561477 0.0604146 -0.0049056 0.093388 -0.0012138 0.231634 0. 0.2484764 -0.2585557 0. 0. 0. -0.0357269 0.1189093 0.0179107 -0.0339303 -0.0272086 0.0780751 0.0074138 -0.0298437 0.027068 0.0821451 0.1189093 0.0179107 0.0339303 -0.0272086 0.0780751 -0.0074138 0.0298437 -0.027068 0.0821451 0.057443 -0.004878 0. 0.0201857 0.0896592 0. 0. 0. 0.138342 -0.0536563 0.0720425 0. 0.1426731 0.2588566 0. 0. 0. -0.0963125 0.1257795 -0.0035621 0. -0.0044115 0.1110647 0. 0. 0. 0.1214938 -0.4146089 -0.191068 0. -0.0979936 0.1317018 0. 0. 0. 0.080869 0.0709082 0.0249743 0. 0.0051957 0.0428438 0. 0. 0. 0.1138788 0.2043617 0.0471469 0.1552725 0.0278443 -0.0368697 0.0302027 -0.0982345 -0.0588088 0.1682452 0.1297872 -0.0188073 -0.0153119 -0.0042376 0.1037553 0.0294577 -0.0661877 -0.0018936 0.0642581 -0.1067104 0.0725075 0.0137259 -0.0617874 -0.0471415 0.0231763 -0.0770696 0.0389701 -0.2243792 0.0563195 -0.0287973 -0.0373837 0.0043856 0.1167695 0.0109978 0.0466052 0.0173375 0.1550708 0.2043617 0.0471469 -0.1552725 0.0278443 -0.0368697 -0.0302027 0.0982345 0.0588088 0.1682452 0.1297872 -0.0188073 0.0153119 -0.0042376 0.1037553 -0.0294577 0.0661877 0.0018936 0.0642581 -0.1067104 0.0725074 -0.0137259 -0.0617874 -0.0471415 -0.0231763 0.0770696 -0.0389701 -0.2243792 0.0563195 -0.0287973 0.0373837 0.0043856 0.1167695 -0.0109978 -0.0466052 -0.0173375 0.1550708 unknown
polarizability: 76.7934305|4.0221893|90.0874511|0.|0.|76.3901271 unknown
InChI: InChI=1/9C.9H
charge 1 multiplicity 1
18 atoms
C  0.05976301 -1.30661477 0.75740405
C  0.05976301 -1.30661477 -0.75740405
C  -1.30704667 -0.81205076 0.0000
H  -0.07114102 -2.28821703 1.22234832
H  -0.07114102 -2.28821703 -1.22234832
H  -2.12903317 -1.53052724 0.0000
C  -1.51473949 0.55597002 0.0000
H  -2.52387869 0.97678232 0.0000
C  -0.35382918 1.43056856 0.0000
H  -0.5593703 2.50677042 0.0000
C  0.74019893 1.01445121 1.01317621
H  1.38020543 1.81502832 1.39068228
C  0.77235779 -0.27590109 1.46370018
H  1.36278962 -0.5489333 2.34280054
C  0.74019893 1.01445121 -1.01317621
H  1.38020543 1.81502832 -1.39068228
C  0.77235779 -0.27590109 -1.46370018
H  1.36278962 -0.5489333 -2.34280054
