program: Gaussian 16
title: Title Card Required
version: ES64L-G16RevA.03
frameworkgroup: CS[SG(C3H3),X(C6H6)]
method: RwB97XD
basis: def2TZVP
operation: Freq
keyword: #N
keyword: Geom=AllCheck
keyword: Guess=TCheck
keyword: SCRF=Check
keyword: GenChk
keyword: RwB97XD/def2TZVP
keyword: Freq
converged: YES YES YES YES
title: Mulliken charges:
elementType: C C C H H H C H C H C H C H C H C H
charge: 0.004591 0.004591 0.011752 0.190247 0.190247 0.195707 -0.283991 0.209134 0.144573 0.184908 -0.073828 0.199975 -0.254524 0.202497 -0.073828 0.199975 -0.254524 0.202497
chargesum: 1.00000
title: Mulliken charges with hydrogens summed into heavy atoms:
elementType: C C C C C C C C C
charge: 0.194838 0.194838 0.207459 -0.074857 0.329481 0.126146 -0.052026 0.126146 -0.052026
1716.lowfreq: -306.1802 -13.9425 -0.0003 0.0006 0.0006 3.2917 11.2615 270.6769 402.4770
frequency: -306.1801 270.6767 402.4768 482.6493 487.4709 503.6176 520.8932 577.4886 635.6248 671.0176 696.9103 763.6958 813.0429 844.8694 895.4700 908.1358 928.8629 940.4341 968.8740 984.2174 1015.7407 1016.1944 1076.2457 1086.8293 1100.7952 1124.7024 1160.6082 1166.4259 1182.2238 1186.0462 1237.4935 1328.4498 1337.9082 1424.2428 1446.0517 1458.7071 1516.1430 1597.7766 1606.7312 3218.1219 3227.5657 3231.5885 3235.9717 3237.5884 3241.5778 3254.8159 3256.4332 3258.6531
redmass: 7.0246 5.0035 4.2448 2.3310 2.2528 5.1774 7.4528 6.2136 2.2701 5.9290 3.8776 1.5111 1.6518 1.6330 2.7848 2.7411 1.6028 2.0549 1.7932 1.5419 1.6803 1.3252 1.7816 1.5223 1.2950 1.2655 1.1525 1.0874 1.4656 1.1473 1.7865 1.2329 1.2466 2.4586 1.8645 1.9560 2.6535 5.0972 5.5856 1.0913 1.0899 1.0898 1.0918 1.0926 1.0945 1.0994 1.0966 1.0989
irintensity: 18.6171 0.0217 0.0106 0.3872 0.9443 2.0443 5.7193 5.6944 1.0025 0.8099 4.0172 30.2563 33.4746 0.4544 11.8974 3.4494 1.4332 23.7181 2.2532 9.5410 18.8440 0.5059 12.7145 0.0170 0.0004 10.7046 0.1617 0.0241 6.6379 5.2989 35.8243 0.5055 0.4230 5.0076 26.0194 8.4439 15.9359 2.1526 0.0030 1.0789 3.9110 9.0328 9.8373 19.1480 17.5845 8.6860 22.8781 1.5307
temp: 298.150 k
press: 1.00000 atm
elementType: 6 6 6 1 1 1 6 1 6 1 6 1 6 1 6 1 6 1
symmnumber: 1
zpe: 397926.2 jmol-1
zpe.correction: 0.151562 hartree
zpe.thermalcorrener: 0.157436 hartree
zpe.thermalcorrenthalpy: 0.158380 hartree
zpe.thermalcorrgfe: 0.121965 hartree
zpe.sumelectzpe: -347.868293 hartree
zpe.sumelectthermal: -347.862419 hartree
zpe.sumelectthermalent: -347.861475 hartree
zpe.sumelectthermalfe: -347.897890 hartree
dipole: -0.3487 0.0744 -0.0000
dipole: 0.3565
quadrupole: -41.0170 -34.7196 -43.0043
quadrupole: 2.3046 0.0000 -0.0000
quadrupole: -1.4367 4.8607 -3.4240 2.3046 0.0000 -0.0000
hfenergy: -348.0198552 hartree
pointgroup: CS [SG(C3H3),X(C6H6)]
dipole: -0.13678 0.0310955 0. debye
dipolederiv: 0.2057508 -0.1861764 -0.1012097 -0.1363127 0.0761376 -0.0833307 -0.0957006 -0.0172957 0.0447608 0.2057508 -0.1861765 0.1012097 -0.1363126 0.0761376 0.0833307 0.0957005 0.0172957 0.0447609 0.00062 0.2179176 0. 0.2581414 -0.3007063 0. 0. 0. 0.0941708 0.1191387 0.0163877 -0.0393353 -0.0231465 0.0895819 0.0052534 -0.0285761 0.0265425 0.0849898 0.1191387 0.0163877 0.0393353 -0.0231465 0.0895819 -0.0052534 0.0285762 -0.0265425 0.0849898 0.0595437 -0.0028434 0. 0.0291225 0.0977685 0. 0. 0. 0.1370733 -0.0723669 0.0939275 0. 0.1784506 0.2306818 0. 0. 0. -0.0794626 0.1366329 -0.0069564 0. -0.0071018 0.1165231 0. 0. 0. 0.0924983 -0.459789 -0.1160985 0. -0.1336776 0.0896718 0. 0. 0. 0.1503147 0.0718518 0.0272083 0. 0.0001345 0.0671001 0. 0. 0. 0.1329217 0.2505404 -0.0127649 0.0831469 0.0278639 -0.0695176 0.1003233 -0.1821645 0.0699994 0.1452018 0.1284328 -0.0088786 -0.0169684 0.0000755 0.108372 0.0306957 -0.0588061 -0.0063482 0.0686766 -0.1276142 0.1012034 0.0039282 -0.0383717 0.0265388 0.049259 -0.082124 0.0201947 -0.2506151 0.0555053 -0.0163488 -0.0102676 0.0073567 0.1183679 0.0047704 0.0500166 0.0068178 0.1432279 0.2505404 -0.0127649 -0.0831469 0.0278638 -0.0695176 -0.1003233 0.1821645 -0.0699994 0.1452019 0.1284328 -0.0088786 0.0169684 0.0000755 0.108372 -0.0306957 0.0588061 0.0063482 0.0686766 -0.1276143 0.1012034 -0.0039282 -0.0383716 0.0265388 -0.049259 0.0821241 -0.0201947 -0.2506152 0.0555053 -0.0163488 0.0102676 0.0073567 0.1183679 -0.0047704 -0.0500166 -0.0068178 0.1432279 unknown
polarizability: 84.1309383|2.2477016|90.4048193|0.|0.|83.5569371 unknown
InChI: InChI=1/9C.9H
charge 1 multiplicity 1
18 atoms
C  0.03967299 -1.29590623 0.75738307
C  0.03967299 -1.29590623 -0.75738307
C  -1.31256538 -0.78557167 0.0000
H  -0.09343771 -2.26534984 1.21542042
H  -0.09343771 -2.26534984 -1.21542042
H  -2.12950181 -1.49023253 0.0000
C  -1.50480216 0.56871165 0.0000
H  -2.50153765 0.988467 0.0000
C  -0.36791786 1.42621964 0.0000
H  -0.53760708 2.49419617 0.0000
C  0.78211613 0.97800573 0.92479111
H  1.41438636 1.76515775 1.30660781
C  0.7653695 -0.2865805 1.42782865
H  1.3277097 -0.53375203 2.31750015
C  0.78211613 0.97800573 -0.92479111
H  1.41438636 1.76515775 -1.30660781
C  0.7653695 -0.2865805 -1.42782865
H  1.3277097 -0.53375203 -2.31750015
